β-Copaene

Van Den Dool and Kratz RI, polar column, temperature ramp

Data compiled by: NIST Mass Spectrometry Data Center, William E. Wallace, director

Column type CapillaryCapillaryCapillaryCapillaryCapillary
Active phase BP-20RTX-WaxRTX-WaxBP-20RTX-Wax
Column length (m) 50.60.60.50.60.
Carrier gas HeHeHeHeHe
Substrate
Column diameter (mm) 0.220.220.220.220.22
Phase thickness (μm) 0.250.250.250.250.25
Tstart (C) 60.60.60.60.60.
Tend (C) 220.230.230.220.230.
Heat rate (K/min) 2.2.2.2.2.
Initial hold (min)
Final hold (min) 20.30.35.20.35.
I 1580.1565.1585.1580.1585.
ReferenceLesueur, de Rocca Serra, et al., 2007Muselli, Rossi, et al., 2007Paolini, Muselli, et al., 2007Gonny, Cavaleiro, et al., 2006Paolini, Costa, et al., 2005
Comment MSDC-RI MSDC-RI MSDC-RI MSDC-RI MSDC-RI
Column type CapillaryCapillaryCapillary
Active phase RTX-WaxCarbowax 20MDB-Wax
Column length (m) 60.50.60.
Carrier gas HeHeHe
Substrate
Column diameter (mm) 0.220.20.20
Phase thickness (μm) 0.250.20.20
Tstart (C) 60.30.70.
Tend (C) 230.170.180.
Heat rate (K/min) 2.4.2.
Initial hold (min)  2.5.
Final hold (min) 45.20.
I 1581.1631.1631.
ReferenceCavalli, Tomi, et al., 2003Píry, Príbela, et al., 1995Stashenko, Wiame, et al., 1995
Comment MSDC-RI MSDC-RI MSDC-RI

Kovats' RI, non-polar column, isothermal

Data compiled by: NIST Mass Spectrometry Data Center, William E. Wallace, director

Column type Packed
Active phase SE-30
Column length (m)
Carrier gas He
Substrate Chromosorb G
Column diameter (mm)
Phase thickness (μm)
Temperature (C) 130.
I 1422.5
ReferenceAndersen and Falcone, 1969
Comment MSDC-RI

Normal alkane RI, non-polar column, custom temperature program

Data compiled by: NIST Mass Spectrometry Data Center, William E. Wallace, director

Column type CapillaryCapillaryCapillaryCapillaryCapillary
Active phase HP-5Elite-5 MSDB-1CP Sil 8 CBSLB-5 MS
Column length (m) 25.30.30.50.30.
Carrier gas HydrogenHeliumHydrogenHeliumHelium
Substrate
Column diameter (mm) 0.320.250.250.320.25
Phase thickness (μm) 0.520.250.250.250.25
Program not specified60 0C (1 min) 1.5 0C/min -> 185 0C (1 min) 9 0C/min -> 275 0C (2 min)45 0C 3 0C/min -> 175 0C 15 0C/min -> 300 0C (10 min)not specifiednot specified
I 1432.1421.1426.1431.1432.
ReferenceVelickovic, Ristic, et al., 2012Kapoor, Singh, et al., 2009Mendes, Trindade, et al., 2009Kupcinskiene, Stikliene, et al., 2008Lo Presti, Sciarrone, et al., 2008
Comment MSDC-RI MSDC-RI MSDC-RI MSDC-RI MSDC-RI
Column type CapillaryCapillaryCapillaryCapillaryCapillary
Active phase DB-15 % Phenyl methyl siloxaneDB-5DB-5CP Sil 8 CB
Column length (m) 30. 30.30.50.
Carrier gas He HeHeHelium
Substrate
Column diameter (mm) 0.25 0.250.250.32
Phase thickness (μm) 0.25 0.250.250.25
Program 45C => 3C/min => 175C => 15C/min => 300C (10min)not specified35C => 4C/min => 180C => 10C/min => 250C50C(1min) => 3C/min => 250C(10min) => 20C/min => 280C (5min)60 0C (2 min) 5 0C/min -> 160 0C (1 min) 10 0C/min -> 280 0C (3 min)
I 1426.1473.1431.1432.1432.
ReferenceNogueira, Marcelo-Curto, et al., 2008Agabriel, Cornu, et al., 2007Albuquerque, Lemos, et al., 2007Parker, Pollnitz, et al., 2007Radusiene, Judzentiene, et al., 2007
Comment MSDC-RI MSDC-RI MSDC-RI MSDC-RI MSDC-RI
Column type CapillaryCapillaryCapillaryCapillaryCapillary
Active phase HP-5MSCP Sil 8 CBCP Sil 8 CBSE-52DB-5
Column length (m) 30.50.50.30.30.
Carrier gas HeHeHeHeHe
Substrate
Column diameter (mm) 0.250.320.320.320.25
Phase thickness (μm) 0.250.250.250.150.25
Program 50C(3min) => 3C/min => 150C(10min) => 10C/min => 250C60C(2min) => 5C/min => 160C(1min) => 10C/min => 250C (5min)60 0C (2 min) 5 0C/min -> 160 0C 10 0C/min -> 250 0C (5 min)45C => 1C/min => 100C => 5C/min => 250C (10min)35C => 4C/min => 180C => 10C/min => 250C
I 1459.1432.1432.1432.1428.
ReferenceGüllüce, Özer, et al., 2006Judzentiene and Buzelyte, 2006Mockute, Bernotiene, et al., 2006Tognolini, Barocelli, et al., 2006Cysne, Canuto, et al., 2005
Comment MSDC-RI MSDC-RI MSDC-RI MSDC-RI MSDC-RI
Column type CapillaryCapillaryCapillaryCapillaryCapillary
Active phase BPX5HP-5MSHP-5SE-30CP Sil 8 CB
Column length (m) 25.30.30. 50.
Carrier gas HeliumHeHe He
Substrate
Column diameter (mm) 0.220.250.25 0.32
Phase thickness (μm) 0.250.250.25 0.25
Program not specified50C(3min) => 3C/min => 150C(10min) => 10C/min => 250C50C (3min) => 3C/min => 150C (10min) => 10C/min => 250Cnot specified70C(5min) => 3C/min => 100C (1min) => 25C/min => 250C (10min)
I 1430.1432.1432.1445.1435.
ReferenceDickschat, Bode, et al., 2005Sahin, Gulluce, et al., 2004Tepe, Donmez, et al., 2004Vinogradov, 2004Mockute and Judzentiene, 2003
Comment MSDC-RI MSDC-RI MSDC-RI MSDC-RI MSDC-RI
Column type CapillaryCapillaryCapillaryCapillaryCapillary
Active phase HP-1Methyl Silicone5 % Phenyl methyl siloxaneDB-1OV-101
Column length (m) 50.  60.
Carrier gas N2
Substrate
Column diameter (mm) 0.32  0.32
Phase thickness (μm) 0.52
Program 40C => 2C/min => 130C => 4C/min => 250Cnot specifiednot specifiednot specifiednot specified
I 1418.1445.1446.1424.1445.
ReferenceTeai, Claude-Lafontaine, et al., 2001Zenkevich, 1996Sagrero-Nieves and Bartley, 1995Binder and Flath, 1989Shibamoto, 1987
Comment MSDC-RI MSDC-RI MSDC-RI MSDC-RI MSDC-RI

Kovats' RI, non-polar column, temperature ramp

Data compiled by: NIST Mass Spectrometry Data Center, William E. Wallace, director

Column type CapillaryCapillaryCapillaryCapillaryCapillary
Active phase DB-5DB-1DB-5DB-5HP-5MS
Column length (m) 30.25.30.30.30.
Carrier gas HeHe HeHe
Substrate
Column diameter (mm) 0.250.20.250.260.25
Phase thickness (μm) 0.25 0.250.250.25
Tstart (C) 60.60.40.60.50.
Tend (C)  220.210.246.250.
Heat rate (K/min) 3.3.2.3.3.
Initial hold (min)  3.2. 10.
Final hold (min)   33. 5.
I 1430.1437.1428.1432.1433.
ReferenceLucero, Fredrickson, et al., 2006Mevy, Bessiere, et al., 2006Sylvestre, Pichette, et al., 2006Adams, Morris, et al., 2005Asuming, Beauchamp, et al., 2005
Comment MSDC-RI MSDC-RI MSDC-RI MSDC-RI MSDC-RI
Column type CapillaryCapillaryCapillaryCapillaryCapillary
Active phase HP-5DB-5CP Sil 8 CBHP-5MSDB-5
Column length (m) 30.25.30.30.30.
Carrier gas HeHeH2HeHe
Substrate
Column diameter (mm) 0.250.250.250.250.26
Phase thickness (μm) 0.250.250.250.250.25
Tstart (C) 60.60.50.50.60.
Tend (C) 260.180.220.250.240.
Heat rate (K/min) 3.5.3.3.3.
Initial hold (min)  6.2.
Final hold (min)  15.
I 1430.1428.1437.1428.1428.
ReferenceLopes, Strobl, et al., 2004Merle, Morón, et al., 2004Schwob, Bessiere, et al., 2004Salido, Altarejos, et al., 2002Adams, 2000
Comment MSDC-RI MSDC-RI MSDC-RI MSDC-RI MSDC-RI
Column type CapillaryCapillary
Active phase OV-101Methyl Silicone
Column length (m) 25.12.
Carrier gas
Substrate
Column diameter (mm) 0.320.5
Phase thickness (μm)
Tstart (C) 50.70.
Tend (C) 200.250.
Heat rate (K/min) 5.4.
Initial hold (min)
Final hold (min)  15.
I 1402.1447.1
ReferenceKuiate, Zollo, et al., 1999Rao, Rajanikanth, et al., 1989
Comment MSDC-RI MSDC-RI

References

Lesueur, de Rocca Serra, et al., 2007
Lesueur, D.; de Rocca Serra, D.; Bighelli, A.; Hoi, T.M.; Ban, N.K.; Thai, T.H.; Casanova, J., Chemical composition and antibacterial activity of the essential oil of Michelia foveolata Merryll ex Dandy from Vietnam, Flavour Fragr. J., 2007, 22, 4, 317-321, https://doi.org/10.1002/ffj.1799 . [all data]

Muselli, Rossi, et al., 2007
Muselli, A.; Rossi, P.-G.; Desjobert, J.-M.; Bernardini, A.-F.; Berti, L.; Costa, J., Chemical composition and antibacterial activity of Otanthus maritimus (L.) Hoffmanns. Link essential oils from Corsica, Flavour Fragr. J., 2007, 22, 3, 217-223, https://doi.org/10.1002/ffj.1787 . [all data]

Paolini, Muselli, et al., 2007
Paolini, J.; Muselli, A.; Bernardini, A.-F.; Bighelli, A.; Casanova, J.; Costa, J., Thymol derivatives from essential oil of Doronicum corsicum L., Flavour Fragr. J., 2007, 22, 6, 479-487, https://doi.org/10.1002/ffj.1824 . [all data]

Gonny, Cavaleiro, et al., 2006
Gonny, M.; Cavaleiro, C.; Salgueiro, L.; Casanova, J., Analysis of Juniperus communis subsp. alpina needle, berry, wood and root oils by combination of GC, GC/MS and 13C-NMR, Flavour Fragr. J., 2006, 21, 1, 99-106, https://doi.org/10.1002/ffj.1527 . [all data]

Paolini, Costa, et al., 2005
Paolini, J.; Costa, J.; Bernardini, A., Analysis of the essential oil from aerial parts of Eupatorium cannabinum subsp. corsicum (L.) by gas chromatography with electron impact and chemical ionization mass spectrometry, J. Chromatogr. A, 2005, 1076, 1-2, 170-178, https://doi.org/10.1016/j.chroma.2005.03.131 . [all data]

Cavalli, Tomi, et al., 2003
Cavalli, J.-F.; Tomi, F.; Bernardini, A.-F.; Casanova, J., Composition and chemical variability of the bark oil of Cedrelopsis grevei H. Baillon from Madagascar, Flavour Fragr. J., 2003, 18, 6, 532-538, https://doi.org/10.1002/ffj.1263 . [all data]

Píry, Príbela, et al., 1995
Píry, J.; Príbela, A.; Durcanská, J.; Farkas, P., Fractionation of volatiles from blackcurrant (Ribes nigrum L.) by different extractive methods, Food Chem., 1995, 54, 1, 73-77, https://doi.org/10.1016/0308-8146(95)92665-7 . [all data]

Stashenko, Wiame, et al., 1995
Stashenko, E.; Wiame, H.; Dassy, S.; Martinez, J.R.; Shibamoto, T., Catalytic transformation of copaiba (Copaifera officinalis) oil over zeolite ZSM-5, J. Hi. Res. Chromatogr., 1995, 18, 1, 54-58, https://doi.org/10.1002/jhrc.1240180112 . [all data]