2,5,7,10-Tetraoxa-6-silaundecane, 6,6-dimethyl-

Van Den Dool and Kratz RI, non-polar column, custom temperature program

View large format table.

Column type Active phase I Reference Comment
CapillaryVF-5MS1160.Tretyakov, 201130. m/0.25 mm/0.25 μm, He; Program: Multi-step temperature program; T(initial)=60C; T(final)=270C
Capillary5 % Phenyl methyl siloxane1156.Zaikin, 2008Column length: 30. m; Column diameter: 0.19 mm; Program: 20C => 5C/min => 120C => 10C/min => 280C

References

Tretyakov, 2011
Tretyakov, K.V., Retention Data. NIST Mass Spectrometry Data Center., NIST Mass Spectrometry Data Center, 2011. [all data]

Zaikin, 2008
Zaikin, V.G., Personal Communication: Retention indices measured during the period 2007 to 2008, 2008. [all data]