4,4'-Oxydiphthalic dianhydride

Condensed phase thermochemistry data

Data compiled by: Eugene S. Domalski and Elizabeth D. Hearing

Quantity Value Units Method Reference Comment
solid,1 bar319.2J/mol*KN/AKaryakin, Mochalov, et al., 1973

Constant pressure heat capacity of solid

Cp,solid (J/mol*K) Temperature (K) Reference Comment
311.8300.Karyakin, Mochalov, et al., 1973T = 20 to 300 K.

References

Karyakin, Mochalov, et al., 1973
Karyakin, N.V.; Mochalov, A.N.; Kunyevskaya, S.G.; Aron, B.M.; Rabinovich, I.B., Low temperature specific heat of tetracarboxylic acid dianhydrides, Tr. Khim. Khim. Tekhnol, 1973, (1), 60-61. [all data]