2-Heptanone, 5-methyl-

Phase change data

Data compiled by: Thermodynamics Research Center, NIST Boulder Laboratories, Chris Muzny director

Quantity Value Units Method Reference Comment
Tboil433.KN/AColonge and Brunie, 1963Uncertainty assigned by TRC = 3. K
Tboil441.KN/ADjerassi and Geller, 1959Uncertainty assigned by TRC = 3. K

In addition to the Thermodynamics Research Center (TRC) data available from this site, much more physical and chemical property data is available from the following TRC products:

Normal alkane RI, non-polar column, temperature ramp

Data compiled by: NIST Mass Spectrometry Data Center, William E. Wallace, director

Column type Capillary
Active phase BPX-5
Column length (m) 25.
Carrier gas He
Substrate
Column diameter (mm) 0.22
Phase thickness (μm) 0.25
Tstart (C) 50.
Tend (C) 320.
Heat rate (K/min) 5.
Initial hold (min) 5.
Final hold (min)
I 974.
ReferenceDickschat, Martens, et al., 2005
Comment MSDC-RI

Van Den Dool and Kratz RI, polar column, custom temperature program

Data compiled by: NIST Mass Spectrometry Data Center, William E. Wallace, director

Column type Capillary
Active phase CP-Wax 52CB
Column length (m) 60.
Carrier gas He
Substrate
Column diameter (mm) 0.25
Phase thickness (μm) 0.25
Program 40C => 5C/min => 60C => 2.5C/min => 155C
I 1252.
ReferenceAlasalvar, Shahidi, et al., 2003
Comment MSDC-RI

References

Colonge and Brunie, 1963
Colonge, G.; Brunie, J.C., Bull. Soc. Shim. Fr., 1963, 1963, 1799-1802. [all data]

Djerassi and Geller, 1959
Djerassi, C.; Geller, L.E., Optical rotary dispersion studies: xxiv effect of distance of a single asymmetric center from an aliphatic carbonyl function, J. Am. Chem. Soc., 1959, 81, 2789. [all data]