3-Octen-1-ol

Van Den Dool and Kratz RI, polar column, temperature ramp

Data compiled by: NIST Mass Spectrometry Data Center, William E. Wallace, director

Column type CapillaryCapillaryCapillary
Active phase BP-20DB-WaxRTX-Wax
Column length (m) 50.30.30.
Carrier gas He He
Substrate
Column diameter (mm) 0.250.320.25
Phase thickness (μm) 0.250.50.25
Tstart (C) 60.35.45.
Tend (C) 220.240.250.
Heat rate (K/min) 2.5.3.
Initial hold (min)  5.6.
Final hold (min) 20.5.10.
I 1444.1441.1440.
ReferenceBousmaha, Boti, et al., 2006Rega, Fournier, et al., 2003Mondello, Zappia, et al., 2002
Comment MSDC-RI MSDC-RI MSDC-RI

References

Bousmaha, Boti, et al., 2006
Bousmaha, L.; Boti, J.B.; Bekkara, F.A.; Castola, V.; Casanova, J., Infraspecific chemical variability of the essential oil of Lavandula dentata L. from Algeria, Flavour Fragr. J., 2006, 21, 2, 368-372, https://doi.org/10.1002/ffj.1659 . [all data]

Rega, Fournier, et al., 2003
Rega, B.; Fournier, N.; Guichard, E., Solid phase microextraction (SPME) of orange juice flavor: odor representativeness by direct gas chromatography olfactometry (D-GC-O), J. Agric. Food Chem., 2003, 51, 24, 7092-7099, https://doi.org/10.1021/jf034384z . [all data]

Mondello, Zappia, et al., 2002
Mondello, L.; Zappia, G.; Cotroneo, A.; Bonaccorsi, I.; Chowdhury, J.U.; Yusuf, M.; Dugo, G., Studies on the essential oil-bearing plants of Bangladesh. Part VIII. Composition of some Ocimum oils O. basilicum L. var. purpurascens; O. sanctum L. green; O. sanctum L. purple; O. americanum L., citral type; O. americanum L., camphor type, Flavour Fragr. J., 2002, 17, 5, 335-340, https://doi.org/10.1002/ffj.1108 . [all data]