Silane, (iodomethyl)trimethyl-

Gas phase ion energetics data

Data compiled as indicated in comments:
LLK - Sharon G. Lias, Rhoda D. Levin, and Sherif A. Kafafi
LL - Sharon G. Lias and Joel F. Liebman

Ionization energy determinations

IE (eV) Method Reference Comment
9.1 ± 0.1PEBieri, Brogli, et al., 1973LLK

Appearance energy determinations

Ion AE (eV) Other Products MethodReferenceComment
C4H6SiI+9.50CH3ESTTakhistov and Ponomarev, 1994LL
C4H6SiI+9.06CH3EITakhistov and Ponomarev, 1994Unpublished result of N.S.Khlebnikova, V.M.Orlov, D.A.Ponomarev, and V.V.Takhistov; LL
C5H9Si+14.2IESTTakhistov and Ponomarev, 1994LL
C5H9Si+9.50IEITakhistov and Ponomarev, 1994Unpublished result of N.S.Khlebnikova, V.M.Orlov, D.A.Ponomarev, and V.V.Takhistov; LL

References

Bieri, Brogli, et al., 1973
Bieri, G.; Brogli, F.; Heilbronner, E.; Kloster-Jensen, E., A photoelectron spectroscopic investigation of the electronic structure of trimethylsilylhaloacetylenes, J. Electron Spectrosc. Relat. Phenom., 1973, 1, 67. [all data]

Takhistov and Ponomarev, 1994
Takhistov, V.V.; Ponomarev, D.A., Isodesmic reactions and thermochemistry of ions, Org. Mass Spectrom., 1994, 29, 395. [all data]