Pyrazine, 2,3-diethyl-5-methyl-

Normal alkane RI, polar column, temperature ramp

Data compiled by: NIST Mass Spectrometry Data Center, William E. Wallace, director

Column type CapillaryCapillaryCapillaryCapillaryCapillary
Active phase DB-WaxDB-WaxDB-WaxTC-WaxDB-Wax
Column length (m) 30.30.30.60.60.
Carrier gas Helium HeHeHe
Substrate
Column diameter (mm) 0.250.250.250.250.32
Phase thickness (μm) 0.250.250.250.50.25
Tstart (C) 40.40.40.40.40.
Tend (C) 210.200.210.230.230.
Heat rate (K/min) 3.8.5.3.6.
Initial hold (min)  3. 8.
Final hold (min)  20.  20.
I 1493.1504.1499.1504.1478.
ReferenceKumazawa, Sakai, et al., 2010Schirack, Drake, et al., 2006Kumazawa, Kubota, et al., 2005Ishikawa, Ito, et al., 2004Akiyama, Murakami, et al., 2003
Comment MSDC-RI MSDC-RI MSDC-RI MSDC-RI MSDC-RI
Column type CapillaryCapillaryCapillaryCapillaryCapillary
Active phase DB-WaxDB-WaxDB-FFAPDB-WaxDB-Wax
Column length (m) 30.60.30.30.30.
Carrier gas HeHeHeHeHe
Substrate
Column diameter (mm) 0.250.250.320.530.25
Phase thickness (μm) 0.250.250.251.
Tstart (C) 40.40.40.40.70.
Tend (C) 210.210.230.225.160.
Heat rate (K/min) 5.5.6.6.2.
Initial hold (min)   2.5.8.
Final hold (min)   5.30.
I 1499.1499.1480.1490.1488.
ReferenceKumazawa and Masuda, 2002Kumazawa and Masuda, 2002Sanz, Czerny, et al., 2002Cadwallader and Heo, 2001Wong and Bernhard, 1988
Comment MSDC-RI MSDC-RI MSDC-RI MSDC-RI MSDC-RI
Column type CapillaryCapillary
Active phase Carbowax 20MCarbowax 20M
Column length (m) 50.50.
Carrier gas HydrogenN2
Substrate
Column diameter (mm) 0.200.22
Phase thickness (μm)
Tstart (C) 50.80.
Tend (C) 200.200.
Heat rate (K/min) 1.2.
Initial hold (min)
Final hold (min) 35.
I 1515.1459.
ReferenceWu, Liou, et al., 1987Mihara and Enomoto, 1985
Comment MSDC-RI MSDC-RI

Normal alkane RI, polar column, custom temperature program

Data compiled by: NIST Mass Spectrometry Data Center, William E. Wallace, director

Column type CapillaryCapillaryCapillaryCapillaryCapillary
Active phase FFAPHP-InnowaxHP-InnowaxInnowaxDB-FFAP
Column length (m)  60.60.30.30.
Carrier gas HeliumHeliumHeliumHeliumHe
Substrate
Column diameter (mm)  0.320.320.250.32
Phase thickness (μm)  0.250.250.500.25
Program not specified40 0C (5 min) 4 0C/min -> 60 0C (5 min) 8 0C/min -> 250 0C (3 min)not specified40 0C (2 min) 10 0C/min -> 100 0C 3 0C/min -> 160 0C 5 0C/min -> 260 0C (10 min)35 0C (2 min) 40 K/min -> 60 0C (1 min) 6 K/min -> 240 0C
I 1454.1501.1494.1505.1485.
ReferenceFrauendorfer and Schieberle, 2008Viegas and Bassoli, 2007Viegas and Bassoli, 2007Ito and Mori, 2004Mayer and Grosch, 2001
Comment MSDC-RI MSDC-RI MSDC-RI MSDC-RI MSDC-RI
Column type CapillaryCapillaryCapillaryCapillaryCapillary
Active phase FFAPFFAPFFAPFFAPFFAP
Column length (m) 30.25.30.30.
Carrier gas HeHeHeHe
Substrate
Column diameter (mm) 0.320.320.320.32
Phase thickness (μm) 0.250.250.250.25
Program 35C(1min) => 40C/min => 60C (1min) => 6C/min => 230C35C(2min) => 40C/min => 60C(2min) => 6C/min => 230C35C (2min) => 40C/min => 60C (2min) => 6C/min => 180C => 10C/min => 240C35C (2min) => 40C/min => 60C (2min) => 6C/min => 180C => 10C/min => 240Cnot specified
I 1465.1469.1490.1490.1478.
ReferenceMatsui, Guth, et al., 1998Zehentbauer and Grosch, 1998Schermann and Schieberle, 1997Schermann and Schieberle, 1997Guth and Grosch, 1994
Comment MSDC-RI MSDC-RI MSDC-RI MSDC-RI MSDC-RI
Column type CapillaryCapillaryCapillaryCapillary
Active phase Supelcowax-10FFAPFFAPCarbowax 20M
Column length (m) 30.
Carrier gas He
Substrate
Column diameter (mm) 0.32
Phase thickness (μm)
Program 35C => 40C/min => 60C(2min) => 4C/min => 240Cnot specifiednot specifiednot specified
I 1538.1478.1485.1459.
ReferenceSchieberle and Grosch, 1994Guth and Grosch, 1993Blank, Sen, et al., 1992Mihara and Masuda, 1987
Comment MSDC-RI MSDC-RI MSDC-RI MSDC-RI

Normal alkane RI, non-polar column, temperature ramp

Data compiled by: NIST Mass Spectrometry Data Center, William E. Wallace, director

Column type CapillaryCapillaryCapillaryCapillaryCapillary
Active phase DB-5HP-5DB-5 MSMDN-5MDN-5
Column length (m) 30.50.30.60.60.
Carrier gas HeliumHelium HeHe
Substrate
Column diameter (mm) 0.250.200.250.250.25
Phase thickness (μm) 0.250.330.250.250.25
Tstart (C) 50.50.40.40.40.
Tend (C) 220.280.200.270.270.
Heat rate (K/min) 4.10.8.4.4.
Initial hold (min)   3.4.4.
Final hold (min)  8.520.5.5.
I 1172.1157.1153.1153.1155.
ReferenceShedid, 2010Du, Clery, et al., 2008Schirack, Drake, et al., 2006van Loon, Linssen, et al., 2005van Loon, Linssen, et al., 2005
Comment MSDC-RI MSDC-RI MSDC-RI MSDC-RI MSDC-RI
Column type CapillaryCapillaryCapillaryPackedCapillary
Active phase DB-5DB-5MSHP-5SE-54OV-101
Column length (m) 30.30.50.3.50.
Carrier gas HeHe  N2
Substrate    Chromosorb G AW DMCS (100-120 mesh)
Column diameter (mm) 0.320.530.32 0.22
Phase thickness (μm) 0.251.50.52
Tstart (C) 40.40.35.50.80.
Tend (C) 230.225.250.230.200.
Heat rate (K/min) 6.6.2.6.2.
Initial hold (min) 2.5.15.2.
Final hold (min) 5.30.45.10.
I 1158.1165.1157.1158.1137.
ReferenceSanz, Czerny, et al., 2002Cadwallader and Heo, 2001Boylston and Viniyard, 1998Schieberle, 1991Mihara and Masuda, 1987
Comment MSDC-RI MSDC-RI MSDC-RI MSDC-RI MSDC-RI
Column type CapillaryCapillary
Active phase OV-1OV-101
Column length (m) 50.50.
Carrier gas HydrogenN2
Substrate
Column diameter (mm) 0.200.22
Phase thickness (μm)
Tstart (C) 50.80.
Tend (C) 200.200.
Heat rate (K/min) 1.2.
Initial hold (min)
Final hold (min) 35.
I 1135.1137.
ReferenceWu, Liou, et al., 1987Mihara and Enomoto, 1985
Comment MSDC-RI MSDC-RI

References

Kumazawa, Sakai, et al., 2010
Kumazawa, K.; Sakai, N.; Amma, H.; Sakamoto, S.; Kodama, M.; Wada, Y.; Nishimura, O., Identification and formation of volatile components responsible for the characteristic aroma of Mat Rush (Igusa), Biosci. Biotechnol. Biochem., 2010, 74, 6, 1231-1236, https://doi.org/10.1271/bbb.100053 . [all data]

Schirack, Drake, et al., 2006
Schirack, A.V.; Drake, M.A.; Sander, T.H.; Sandeep, K.P., Characterization of aroma-active compounds in microwave blanched peanuts, J. Food Sci., 2006, 71, 9, c513-c520, https://doi.org/10.1111/j.1750-3841.2006.00173.x . [all data]

Kumazawa, Kubota, et al., 2005
Kumazawa, K.; Kubota, K.; Masuda, H., Influence of Manufacturing Conditions and Crop Season on the Formation of 4-Mercapto-4-methyl-2-pentanone in Japanese Green Tea (Sen-cha), J. Agric. Food Chem., 2005, 53, 13, 5390-5396, https://doi.org/10.1021/jf050392z . [all data]

Ishikawa, Ito, et al., 2004
Ishikawa, M.; Ito, O.; Ishizaki, S.; Kurobayashi, Y.; Fujita, A., Solid-phase aroma concentrate extraction (SPACE ): a new headspace technique for more sensitive analysis of volatiles, Flavour Fragr. J., 2004, 19, 3, 183-187, https://doi.org/10.1002/ffj.1322 . [all data]

Akiyama, Murakami, et al., 2003
Akiyama, M.; Murakami, K.; Ohtani, N.; Iwatsuki, K.; Sotoyama, K.; Wada, A.; Tokuno, K.; Iwabuchi, H.; Tanaka, K., Analysis of volatile compounds released during the grinding of roasted coffee beans using solid-phase microextraction, J. Agric. Food Chem., 2003, 51, 7, 1961-1969, https://doi.org/10.1021/jf020724p . [all data]

Kumazawa and Masuda, 2002
Kumazawa, K.; Masuda, H., Identification of potent odorants in different green tea varieties using flavor dilution technique, J. Agric. Food Chem., 2002, 50, 20, 5660-5663, https://doi.org/10.1021/jf020498j . [all data]

Sanz, Czerny, et al., 2002
Sanz, C.; Czerny, M.; Cid, C.; Schieberle, P., Comparison of potent odorants in a filtered coffee brew and in an instant coffee beverage by aroma extract dilution analysis (AEDA), Eur. Food Res. Technol., 2002, 214, 4, 299-302, https://doi.org/10.1007/s00217-001-0459-9 . [all data]

Cadwallader and Heo, 2001
Cadwallader, K.R.; Heo, J., Aroma of roasted sesame oil: characterization by direct thermal desorption-gas chromatography-olfactometry and sample dilution analysis, Am. Chem. Soc. Symp. Ser., 2001, 782, 187-202. [all data]

Wong and Bernhard, 1988
Wong, J.M.; Bernhard, R.A., Effect of nitrogen source on pyrazine formation, J. Agric. Food Chem., 1988, 36, 1, 123-129, https://doi.org/10.1021/jf00079a032 . [all data]

Wu, Liou, et al., 1987
Wu, C.-M.; Liou, S.-E.; Chang, Y.-H.; Chiang, W., Volatile compounds of the wax gourd (Benincasa hispida, Cogn) and a wax gourd beverage, J. Food Sci., 1987, 52, 1, 132-134, https://doi.org/10.1111/j.1365-2621.1987.tb13988.x . [all data]

Mihara and Enomoto, 1985
Mihara, S.; Enomoto, N., Calculation of retention indices of pyrazines on the basis of molecular structure, J. Chromatogr., 1985, 324, 428-430, https://doi.org/10.1016/S0021-9673(01)81342-X . [all data]