Acetic acid, trifluoro-, 4-methylphenyl ester

Phase change data

Data compiled as indicated in comments:
AC - William E. Acree, Jr., James S. Chickos

Enthalpy of vaporization

ΔvapH (kcal/mol) Temperature (K) Method Reference Comment
11.4380.A,EBStephenson and Malanowski, 1987Based on data from 365. - 442. K. See also Sheehan and Langer, 1969 and Dykyj, Svoboda, et al., 1999.; AC

Antoine Equation Parameters

log10(P) = A − (B / (T + C))
    P = vapor pressure (atm)
    T = temperature (K)

View plot Requires a JavaScript / HTML 5 canvas capable browser.

Temperature (K) A B C Reference
365.6 - 441.54.80301890.-49.Sheehan and Langer, 1969

Normal alkane RI, non-polar column, temperature ramp

View large format table.

Column type Active phase I Reference Comment
CapillaryOV-101961.Zenkevich and Rodin, 2002Nitrogen, 60. C @ 0. min, 4. K/min, 240. C @ 0. min; Column length: 25. m; Column diameter: 0.25 mm

References

Stephenson and Malanowski, 1987
Stephenson, Richard M.; Malanowski, Stanislaw, Handbook of the Thermodynamics of Organic Compounds, 1987, https://doi.org/10.1007/978-94-009-3173-2 . [all data]

Sheehan and Langer, 1969
Sheehan, Richard J.; Langer, Stanley H., Vapor pressures of fluorine- and silicon-containing derivatives of some hydroxylic compounds, J. Chem. Eng. Data, 1969, 14, 2, 248-250, https://doi.org/10.1021/je60041a011 . [all data]

Dykyj, Svoboda, et al., 1999
Dykyj, J.; Svoboda, J.; Wilhoit, R.C.; Frenkel, M.L.; Hall, K.R., Vapor Pressure of Chemicals: Part A. Vapor Pressure and Antoine Constants for Hydrocarbons and Sulfur, Selenium, Tellurium and Hydrogen Containing Organic Compounds, Springer, Berlin, 1999, 373. [all data]

Zenkevich and Rodin, 2002
Zenkevich, I.G.; Rodin, A.A., Gas Chromatographic One-Step Determination of Number of Hydroxyl Groups in Polyphenols with Mixed Derivatization Reagents, Zh. Anal. Khim. (Rus.), 2002, 57, 7, 732-736. [all data]