Spiro[5.6]dodecane

Condensed phase thermochemistry data

Data compiled by: Hussein Y. Afeefy, Joel F. Liebman, and Stephen E. Stein

Quantity Value Units Method Reference Comment
Δfliquid-60.33 ± 0.61kcal/molCcbSubach and Zwolinski, 1975
Δfliquid-60.5 ± 0.2kcal/molCcbKozin, Mirzaeva, et al., 1964
Quantity Value Units Method Reference Comment
Δcliquid-1819.75 ± 0.55kcal/molCcbSubach and Zwolinski, 1975Corresponding Δfliquid = -60.33 kcal/mol (simple calculation by NIST; no Washburn corrections)
Δcliquid-1819.6 ± 0.2kcal/molCcbKozin, Mirzaeva, et al., 1964Corresponding Δfliquid = -60.5 kcal/mol (simple calculation by NIST; no Washburn corrections)

References

Subach and Zwolinski, 1975
Subach, D.J.; Zwolinski, B.J., Enthalpies of combustion and formation of [4,5], [5,5], and [5,6]spiroalkanes, J. Chem. Thermodyn., 1975, 7, 493-498. [all data]

Kozin, Mirzaeva, et al., 1964
Kozin, M.P.; Mirzaeva, A.K.; Sosina, I.E.; Elagina, N.V.; Skuratov, S.M., The heats of formation of spiro hydrocarbons, Dokl. Phys. Chem. (Engl. Transl.), 1964, 155, 375-377. [all data]