6,6-Dimethyl-1-phenyl-4,8-dioxaspiro[2.5]octane

Phase change data

Data compiled by: William E. Acree, Jr., James S. Chickos

Quantity Value Units Method Reference Comment
Δsub97.5 ± 0.3kJ/molN/AVerevkin, Peng, et al., 1998

Enthalpy of fusion

ΔfusH (kJ/mol) Temperature (K) Reference
27.2351.2Verevkin, Peng, et al., 1998

References

Verevkin, Peng, et al., 1998
Verevkin, S.P.; Peng, W.-H.; Beckhaus, H.D.; Rücuardt, C., Geminal substituent effects. 16. Does the anomeric effect in ketals depend on the hybridization of the central carbon atom?, Eur. J. Org. Chem., 1998, 11, 2323. [all data]