1H-Tetrazole, 5-phenyl-

Gas phase thermochemistry data

Data compiled as indicated in comments:
ALS - Hussein Y. Afeefy, Joel F. Liebman, and Stephen E. Stein
DRB - Donald R. Burgess, Jr.

Quantity Value Units Method Reference Comment
Δfgas413. ± 5.9kJ/molCcbBalepin, Lebedev, et al., 1977ALS
Δfgas407.5kJ/molN/AMcEwan and Rigg, 1951Value computed using ΔfHsolid° value of 292.5 kj/mol from McEwan and Rigg, 1951 and ΔsubH° value of 115.0 kj/mol from Balepin, Lebedev, et al., 1977.; DRB

Condensed phase thermochemistry data

Data compiled by: Hussein Y. Afeefy, Joel F. Liebman, and Stephen E. Stein

Quantity Value Units Method Reference Comment
Δfsolid298. ± 3.kJ/molCcbBalepin, Lebedev, et al., 1977
Δfsolid292.5kJ/molCcbMcEwan and Rigg, 1951
Quantity Value Units Method Reference Comment
Δcsolid-3910. ± 3.kJ/molCcbBalepin, Lebedev, et al., 1977
Δcsolid-3904.6 ± 1.4kJ/molCcbMcEwan and Rigg, 1951

Phase change data

Data compiled as indicated in comments:
ALS - Hussein Y. Afeefy, Joel F. Liebman, and Stephen E. Stein
DRB - Donald R. Burgess, Jr.

Quantity Value Units Method Reference Comment
Δsub115. ± 3.kJ/molVBalepin, Lebedev, et al., 1977ALS
Δsub115.0kJ/molN/ABalepin, Lebedev, et al., 1977DRB

References

Balepin, Lebedev, et al., 1977
Balepin, A.A.; Lebedev, V.P.; Miroshnichenko, E.A.; Koldobskii, G.I.; Ostovskii, V.A.; Larionov, B.P.; Gidaspov, B.V.; Lebedev, Yu.A., Energy effects in polyphenylenes and phenyltetrazoles, Svoistva Veshchestv Str. Mol., 1977, 93-98. [all data]

McEwan and Rigg, 1951
McEwan, W.S.; Rigg, M.W., The heats of combustion of compounds containing the tetrazole ring, J. Am. Chem. Soc., 1951, 73, 4725-4727. [all data]

Elpern and Nachod, 1950
Elpern, B.; Nachod, F.C., J. Am. Chem. Soc., 1950, 72, 3379. [all data]