P-xenyltrichlorosilane

Condensed phase thermochemistry data

Data compiled by: Eugene S. Domalski and Elizabeth D. Hearing

Quantity Value Units Method Reference Comment
solid,1 bar78.59cal/mol*KN/AGeidarov, Dzhafarov, et al., 1976
solid,1 bar78.580cal/mol*KN/AGeidarov, Karasharli, et al., 1977

Constant pressure heat capacity of solid

Cp,solid (cal/mol*K) Temperature (K) Reference Comment
69.570298.15Geidarov, Karasharli, et al., 1977Based on previously published work of authors, not available in detail, on Cp 12 to 370 K.
69.57298.15Geidarov, Dzhafarov, et al., 1976T = 12 to 380 K.

References

Geidarov, Dzhafarov, et al., 1976
Geidarov, Kh.I.; Dzhafarov, O.I.; Karasharli, K.A.; Kostryukov, V.N., The true heat capacity of p-trichlorosilylbiphenyl in the temperature range 12-380 K, Zhur. Fiz. Khim., 1976, 50, 1112-1114. [all data]

Geidarov, Karasharli, et al., 1977
Geidarov, Kh.I.; Karasharli, K.A.; Dzhafarov, O.I., Analysis of the results of the thermodynamic investigation of diphenyl derivatives, Azerb. Khim. Zhur., 1977, (5), 112-115. [all data]