Trimethylsilyllithium tetramer

Gas phase ion energetics data

Data compiled by: Sharon G. Lias, John E. Bartmess, Joel F. Liebman, John L. Holmes, Rhoda D. Levin, and W. Gary Mallard

Appearance energy determinations

Ion AE (eV) Other Products MethodReferenceComment
C3H9Li2Si+10.9?EIVitkovskii and Bravo-Zhivotovskii, 1985
C9H27Li3Si3+9.1C3H9LiSiEIVitkovskii and Bravo-Zhivotovskii, 1985
C9H27Li4Si3+7.9C3H9SiEIVitkovskii and Bravo-Zhivotovskii, 1985

References

Vitkovskii and Bravo-Zhivotovskii, 1985
Vitkovskii, V.Yu.; Bravo-Zhivotovskii, D.A., Mass spectra of (trimethylsilyl) lithium and tert-butyllithium, J. Gen. Chem. USSR, 1985, 56, 853, In original 968. [all data]