tris(1,1,1,2,2,3,3-heptafluoro-7,7-dimethyloctane-4,6-dione)erbium(III)

Phase change data

Data compiled by: William E. Acree, Jr., James S. Chickos

Enthalpy of sublimation

ΔsubH (kcal/mol) Temperature (K) Method Reference
37.0 ± 1.0349. - 362.MESwain and Karraker, 1971

References

Swain and Karraker, 1971
Swain, H.A.; Karraker, D.G., Vapor pressure of some tris-(Heptafluorodimethyloctanediono) lanthanide(III) chelates, Journal of Inorganic and Nuclear Chemistry, 1971, 33, 9, 2851-2856, https://doi.org/10.1016/0022-1902(71)80046-5 . [all data]