1,1':4',1''-Tercyclohexane

Condensed phase thermochemistry data

Data compiled by: Eugene S. Domalski and Elizabeth D. Hearing

Constant pressure heat capacity of liquid

Cp,liquid (J/mol*K) Temperature (K) Reference
564.4423.Gudinowicz, Campbell, et al., 1963

References

Gudinowicz, Campbell, et al., 1963
Gudinowicz, B.J.; Campbell, R.H.; Adams, J.S., Specific heat measurements of complex saturated hydrocarbons, J. Chem. Eng. Data, 1963, 8, 201-214. [all data]