Dodecylcyclohexane

Condensed phase thermochemistry data

Data compiled as indicated in comments:
ALS - Hussein Y. Afeefy, Joel F. Liebman, and Stephen E. Stein
DH - Eugene S. Domalski and Elizabeth D. Hearing

Quantity Value Units Method Reference Comment
Δfliquid-467.6 ± 3.6kJ/molCcbMoore, Renquist, et al., 1940Reanalyzed by Cox and Pilcher, 1970, Original value = -471.24 kJ/mol; ALS
Quantity Value Units Method Reference Comment
Δcliquid-11850.3 ± 2.6kJ/molCcbProsen, Johnson, et al., 1946Corresponding Δfliquid = -377.9 kJ/mol (simple calculation by NIST; no Washburn corrections); ALS
Δcliquid-11760.6 ± 3.5kJ/molCcbMoore, Renquist, et al., 1940Reanalyzed by Cox and Pilcher, 1970, Original value = -11755.5 ± 3.5 kJ/mol; Corresponding Δfliquid = -467.56 kJ/mol (simple calculation by NIST; no Washburn corrections); ALS

Constant pressure heat capacity of liquid

Cp,liquid (J/mol*K) Temperature (K) Reference Comment
615.5298.15Parks, Moore, et al., 1949Extrapolation below 80 K, 119.3 J/mol*K.; DH

Kovats' RI, non-polar column, isothermal

Data compiled by: NIST Mass Spectrometry Data Center, William E. Wallace, director

Column type CapillaryPacked
Active phase RTX-1Methyl Silicone
Column length (m) 6.
Carrier gas
Substrate
Column diameter (mm) 0.1
Phase thickness (μm) 0.4
Temperature (C) 120.130.
I 1818.1822.
ReferenceArey J.S., Nelson R.K., et al., 2005Antheaume and Guiochon, 1965
Comment MSDC-RI MSDC-RI

References

Moore, Renquist, et al., 1940
Moore, G.E.; Renquist, M.L.; Parks, G.S., Thermal data on organic compounds. XX. Modern combustion data for two methylnonanes, methyl ethyl ketone, thiophene and six cycloparaffins, J. Am. Chem. Soc., 1940, 62, 1505-1507. [all data]

Cox and Pilcher, 1970
Cox, J.D.; Pilcher, G., Thermochemistry of Organic and Organometallic Compounds, Academic Press, New York, 1970, 1-636. [all data]

Prosen, Johnson, et al., 1946
Prosen, E.J.; Johnson, W.H.; Rossini, F.D., Heats of formation and combustion of the normal alkylcyclopentanes and cyclohexanes and the increment per CH2 group for several homologous series of hydrocarbons, J. Res. NBS, 1946, 37, 51-56. [all data]

Parks, Moore, et al., 1949
Parks, G.S.; Moore, G.E.; Renquist, M.L.; Naylor, B.F.; McClaine, L.A.; Fujii, P.S.; Hatton, J.A., Thermal data on organic compounds. XXV. Some heat capacity, entropy and free energy data for nine hydrocarbons of high molecular weight, J. Am. Chem. Soc., 1949, 71, 3386-3389. [all data]