Thiophene, 2,3,4-trimethyl-

Normal alkane RI, non-polar column, temperature ramp

View large format table.

Column type Active phase I Reference Comment
CapillaryPONA982.Yang, Wang, et al., 200450. m/0.20 mm/0.50 μm, N2, 2. K/min; Tstart: 35. C; Tend: 170. C
CapillaryPONA995.Yang, Yang, et al., 200350. m/0.20 mm/0.50 μm, Helium, 2. K/min; Tstart: 30. C; Tend: 170. C
CapillaryCP-Sil 5993.Damste, van Dalen, et al., 198825. m/0.32 mm/0.45 μm, Helium, 0. C @ 5. min, 3. K/min; Tend: 300. C
CapillaryCP-Sil 5993.Damste, van Dalen, et al., 198825. m/0.32 mm/0.45 μm, Helium, 0. C @ 5. min, 3. K/min; Tend: 300. C
CapillaryCP Sil 5 CB993.Damste, Kock-van Dalen, et al., 198825. m/0.32 mm/0.45 μm, He, 3. K/min; Tstart: 50. C; Tend: 300. C
CapillaryCP Sil 5 CB993.Damste, Kock-van Dalen, et al., 198825. m/0.32 mm/0.45 μm, He, 3. K/min; Tstart: 50. C; Tend: 300. C

References

Yang, Wang, et al., 2004
Yang, Y.; Wang, Z.; Zong, B.; Yang, H., Determination of sulfur compounds in fluid catalytic cracking gasoline by gas chromatography with a sulfur chemiluminiscence detector, Chin. J. Chromatogr., 2004, 22, 3, 216-219. [all data]

Yang, Yang, et al., 2003
Yang, Y.T.; Yang, H.Y.; Zong, B.N.; Lu, W.Z., determination and distribution of sulfur compounds in gasoline by gas chromatography-atomic emission detector, Chinise J. Anal. Chem. (Fenxi Huaxue), 2003, 31, 10, 1153-1158. [all data]

Damste, van Dalen, et al., 1988
Damste, J.S.S.; van Dalen, A.C.K.; de Leeuw, J.W.; Schenck, P.A., Identification of homologous series of alkylated thiophenes, thiolanes, thianes and benzothiophenes present in pyrolisates of sulfur-rich kerogenes, J. Chromatogr., 1988, 435, 435-452, https://doi.org/10.1016/S0021-9673(01)82208-1 . [all data]

Damste, Kock-van Dalen, et al., 1988
Damste, J.S.S.; Kock-van Dalen, A.C.; de Leeuw, J.W.; Schenk, P.A., Identification of homologous series of alkylated thiophenes, thiolanes, thianes and benzothiophenes present in pyrolysates of sulphur-rich kerogens, J. Chromatogr., 1988, 435, 435-452, https://doi.org/10.1016/S0021-9673(01)82208-1 . [all data]