Aluminum fluoride

Gas phase thermochemistry data

Quantity Value Units Method Reference Comment
Δfgas-2633.62kJ/molReviewChase, 1998Data last reviewed in September, 1979
Quantity Value Units Method Reference Comment
gas,1 bar387.28J/mol*KReviewChase, 1998Data last reviewed in September, 1979

Gas Phase Heat Capacity (Shomate Equation)

Cp° = A + B*t + C*t2 + D*t3 + E/t2
H° − H°298.15= A*t + B*t2/2 + C*t3/3 + D*t4/4 − E/t + F − H
S° = A*ln(t) + B*t + C*t2/2 + D*t3/3 − E/(2*t2) + G
    Cp = heat capacity (J/mol*K)
    H° = standard enthalpy (kJ/mol)
    S° = standard entropy (J/mol*K)
    t = temperature (K) / 1000.

View plot Requires a JavaScript / HTML 5 canvas capable browser.

View table.

Temperature (K) 298. - 1100.1100. - 6000.
A 110.4994182.3521
B 176.51330.316052
C -163.6153-0.063980
D 53.755200.004431
E -1.538755-6.937574
F -2678.241-2708.471
G 466.5160576.1535
H -2633.623-2633.623
ReferenceChase, 1998Chase, 1998
Comment Data last reviewed in September, 1979 Data last reviewed in September, 1979

References

Chase, 1998
Chase, M.W., Jr., NIST-JANAF Themochemical Tables, Fourth Edition, J. Phys. Chem. Ref. Data, Monograph 9, 1998, 1-1951. [all data]