chloronitromethane

Phase change data

Data compiled by: Thermodynamics Research Center, NIST Boulder Laboratories, Chris Muzny director

Quantity Value Units Method Reference Comment
Tboil393.7KN/ALecat, 1947Uncertainty assigned by TRC = 0.5 K
Tboil395.65KN/ALecat, 1947, 2Uncertainty assigned by TRC = 0.5 K

In addition to the Thermodynamics Research Center (TRC) data available from this site, much more physical and chemical property data is available from the following TRC products:

References

Lecat, 1947
Lecat, M., Orthobaric Azeotropes of Sulfides, Bull. Cl. Sci., Acad. R. Belg., 1947, 33, 160-82. [all data]

Lecat, 1947, 2
Lecat, M., Some azeotropes of which one constituant is heterocyclic nitrogen, Ann. Soc. Sci. Bruxelles, Ser. 1, 1947, 61, 73. [all data]