2-n-Propylthiane

Van Den Dool and Kratz RI, non-polar column, custom temperature program

View large format table.

Column type Active phase I Reference Comment
CapillaryCP-Sil 8CB-MS1117.Elmore, Mottram, et al., 200060. m/0.25 mm/0.25 μm, He; Program: 0C(5min) => 40C/min => 40C (2min) => 4C/min => 280C

Normal alkane RI, non-polar column, temperature ramp

View large format table.

Column type Active phase I Reference Comment
CapillaryCP-Sil 51108.Damste, van Dalen, et al., 198825. m/0.32 mm/0.45 μm, Helium, 0. C @ 5. min, 3. K/min; Tend: 300. C
CapillaryCP Sil 5 CB1108.Damste, Kock-van Dalen, et al., 198825. m/0.32 mm/0.45 μm, He, 3. K/min; Tstart: 50. C; Tend: 300. C

References

Elmore, Mottram, et al., 2000
Elmore, J.S.; Mottram, D.S.; Enser, M.; Wood, J.D., The effects of diet and breed on the volatile compounds of cooked lamb, Meat Sci., 2000, 55, 2, 149-159, https://doi.org/10.1016/S0309-1740(99)00137-0 . [all data]

Damste, van Dalen, et al., 1988
Damste, J.S.S.; van Dalen, A.C.K.; de Leeuw, J.W.; Schenck, P.A., Identification of homologous series of alkylated thiophenes, thiolanes, thianes and benzothiophenes present in pyrolisates of sulfur-rich kerogenes, J. Chromatogr., 1988, 435, 435-452, https://doi.org/10.1016/S0021-9673(01)82208-1 . [all data]

Damste, Kock-van Dalen, et al., 1988
Damste, J.S.S.; Kock-van Dalen, A.C.; de Leeuw, J.W.; Schenk, P.A., Identification of homologous series of alkylated thiophenes, thiolanes, thianes and benzothiophenes present in pyrolysates of sulphur-rich kerogens, J. Chromatogr., 1988, 435, 435-452, https://doi.org/10.1016/S0021-9673(01)82208-1 . [all data]