Azelaic acid, 2TMS derivative

Normal alkane RI, non-polar column, temperature ramp

Data compiled by: NIST Mass Spectrometry Data Center, William E. Wallace, director

Column type CapillaryCapillaryCapillary
Active phase HP-5HP-5HP-5
Column length (m) 30.30.30.
Carrier gas HeliumHeHe
Substrate
Column diameter (mm) 0.250.250.25
Phase thickness (μm) 0.250.250.25
Tstart (C) 50.50.50.
Tend (C) 300.300.300.
Heat rate (K/min) 3. 5.
Initial hold (min)
Final hold (min) 30.
I 1807.1812.1806.
ReferenceIsidorov, Lech, et al., 2008Isidorov, Kotowska, et al., 2005Isidorov, Kotowska, et al., 2005
Comment MSDC-RI MSDC-RI MSDC-RI

References

Isidorov, Lech, et al., 2008
Isidorov, V.A.; Lech, P.; Zolciak, A.; Rusak, N.; Szczepaniak, L., Gas Chromatographic - nass spectrometric investigation of metabolites from the needles and roots of pine seedlings at early stages of pathogenic fungi Armillaria ostoyae attack, Trees, 2008, 22, 4, 531-542, https://doi.org/10.1007/s00468-008-0213-z . [all data]

Isidorov, Kotowska, et al., 2005
Isidorov, V.A.; Kotowska, U.; Vinogorova, V.T., GC Identification of organic compounds based on partition coefficients of their TMS derivatives in a hexane-acetonitrile system and retention indices, Anal. Sci., 2005, 21, 12, 1483-1489, https://doi.org/10.2116/analsci.21.1483 . [all data]