p-Cresol, TMS derivative

Phase change data

Data compiled by: William E. Acree, Jr., James S. Chickos

Enthalpy of vaporization

ΔvapH (kJ/mol) Temperature (K) Method Reference Comment
49.8388.EBSheehan and Langer, 1969Based on data from 374. - 402. K.

Van Den Dool and Kratz RI, non-polar column, temperature ramp

View large format table.

Column type Active phase I Reference Comment
CapillaryOV-11136.Lefevere, Verhaeghe, et al., 198910. m/0.22 mm/0.17 μm, He, 5. K/min; Tstart: 70. C; Tend: 270. C
CapillarySE-521152.Lefevere, Verhaeghe, et al., 198925. m/0.32 mm/0.52 μm, He, 5. K/min; Tstart: 70. C; Tend: 270. C
CapillaryUltra-21154.Tuchman, Bowers, et al., 198425. m/0.31 mm/0.52 μm, He, 5. K/min; Tstart: 50. C; Tend: 300. C
PackedOV-11138.Tanaka, Hine, et al., 1980N2, 100-120 mesh, 70. C @ 0.5 min, 28. K/min; Column length: 1.8 m; Tend: 290. C
PackedOV-11129.Mattsson and Petersson, 1977N2, Supelcoport, 4. K/min; Column length: 2. m; Tstart: 80. C; Tend: 240. C

Van Den Dool and Kratz RI, non-polar column, custom temperature program

View large format table.

Column type Active phase I Reference Comment
PackedOV-1011138.Tanaka and Hine, 1982Program: not specified

Normal alkane RI, non-polar column, temperature ramp

View large format table.

Column type Active phase I Reference Comment
CapillaryMethyl Silicone1136.Tóth and Garay, 199410. m/0.32 mm/0.1 μm, He, 60. C @ 1. min, 12. K/min, 380. C @ 15. min

Normal alkane RI, non-polar column, custom temperature program

View large format table.

Column type Active phase I Reference Comment
CapillarySE-301150.Zimmermann, Lauterbach, et al., 1985Program: not specified

References

Sheehan and Langer, 1969
Sheehan, Richard J.; Langer, Stanley H., Vapor pressures of fluorine- and silicon-containing derivatives of some hydroxylic compounds, J. Chem. Eng. Data, 1969, 14, 2, 248-250, https://doi.org/10.1021/je60041a011 . [all data]

Lefevere, Verhaeghe, et al., 1989
Lefevere, M.F.; Verhaeghe, B.J.; Declerck, D.H.; Van Bocxlaer, J.F.; De Leenheer, A.P.; De Sagher, R.M., Metabolic Profiling of Urinary Organic Acids by Single and Multicolumn Capillary Gas Chromatography, J. Chromatogr. Sci., 1989, 27, 1, 23-29, https://doi.org/10.1093/chromsci/27.1.23 . [all data]

Tuchman, Bowers, et al., 1984
Tuchman, M.; Bowers, L.D.; Fregien, K.D.; Crippin, P.J.; Krivit, W., Capillary Gas Chromatographic Separation of Urinary Organic Acids. Retention Indices of 101 Urinary Acids on a 5% Phenylmethyl Silicone Capillary Column, J. Chromatogr. Sci., 1984, 22, 5, 198-202, https://doi.org/10.1093/chromsci/22.5.198 . [all data]

Tanaka, Hine, et al., 1980
Tanaka, K.; Hine, D.G.; West-Dull, A.; Lynn, T.B., Gas-chromatographic method of analysis for urinary organic acids. I. Retention indices of 155 metabolically important compounds, Clin. Chem., 1980, 26, 13, 1839-1846. [all data]

Mattsson and Petersson, 1977
Mattsson, M.; Petersson, G., Reference GLC Data for the Analysis of Phenolic Compounds as Trimethylsilyl Derivatives, J. Chromatogr. Sci., 1977, 15, 12, 546-554, https://doi.org/10.1093/chromsci/15.12.546 . [all data]

Tanaka and Hine, 1982
Tanaka, K.; Hine, D.G., Compilation of Gas Chromatographic Retention Indices of 163 Metabolically Important Organic Acids, and Their Use in Detection of Patients with Organic Acidurias, J. Chromatogr., 1982, 239, 301-322, https://doi.org/10.1016/S0021-9673(00)81990-1 . [all data]

Tóth and Garay, 1994
Tóth, T.; Garay, F., Separation of novolac resin oligomers and related industrial materials by high temperature capillary gas chromatography, J. Hi. Res. Chromatogr., 1994, 17, 3, 177-179, https://doi.org/10.1002/jhrc.1240170312 . [all data]

Zimmermann, Lauterbach, et al., 1985
Zimmermann, V.; Lauterbach, M.; Jaeger, G., Analytical characterization phenolic compounds obtained from phenosolvan-extracts by use of gas-chromatography with capillary columns, Chem. Tech. (Leipzig), 1985, 37, 11, 476-478. [all data]