Diazene,phenyl(trimethylsilyl)-

Gas phase ion energetics data

Data compiled as indicated in comments:
LLK - Sharon G. Lias, Rhoda D. Levin, and Sherif A. Kafafi
RDSH - Henry M. Rosenstock, Keith Draxl, Bruce W. Steiner, and John T. Herron

Ionization energy determinations

IE (eV) Method Reference Comment
7.05 ± 0.02EISeidl, Bock, et al., 1970RDSH
7.9 ± 0.2PEBock, Wittel, et al., 1976Vertical value; LLK

References

Seidl, Bock, et al., 1970
Seidl, H.; Bock, H.; Wiberg, N.; Veith, M., The color of trimethylsilyl derivatives of diimine, Angew. Chem. Intern. Ed., 1970, 9, 69. [all data]

Bock, Wittel, et al., 1976
Bock, H.; Wittel, K.; Veith, M.; Wiberg, N., Photoelectron spectra and molecular properties. L.1-3 On the blue color of bis(trimethylsilyl)diimine, J. Am. Chem. Soc., 1976, 98, 109. [all data]