Naphthalene-1,3,5-trinitrobenzene adduct

Phase change data

Data compiled by: Eugene S. Domalski and Elizabeth D. Hearing

Enthalpy of phase transition

ΔHtrs (kJ/mol) Temperature (K) Initial Phase Final Phase Reference Comment
1.700220.crystaline, IIIcrystaline, IIRadomska and Radomski, 1980
1.598424.5crystaline, IIcrystaline, IRadomska and Radomski, 1980
31.900430.8crystaline, IliquidRadomska and Radomski, 1980

Entropy of phase transition

ΔStrs (J/mol*K) Temperature (K) Initial Phase Final Phase Reference Comment
7.22220.crystaline, IIIcrystaline, IIRadomska and Radomski, 1980
3.77424.5crystaline, IIcrystaline, IRadomska and Radomski, 1980
74.05430.8crystaline, IliquidRadomska and Radomski, 1980

Condensed phase thermochemistry data

Data compiled by: Eugene S. Domalski and Elizabeth D. Hearing

Constant pressure heat capacity of solid

Cp,solid (cal/mol*K) Temperature (K) Reference Comment
55.81298.15Radomska and Radomski, 1980T = 220 to 400 K. Data given graphically. Cp calculated from equation.

References

Radomska and Radomski, 1980
Radomska, M.; Radomski, R., Calorimetric studies of binary systems of 1,3,5-trinitrobenzene with naphthalene, anthracene, and carbazole. I. Phase transitions and heat capacities of the pure components and charge-transfer complexes, Thermochim. Acta, 1980, 40, 405-414. [all data]