Phenol, 3,4-dichloro-, acetate

Kovats' RI, non-polar column, isothermal

View large format table.

Column type Active phase Temperature (C) I Reference Comment
CapillarySE-30160.1377.Evans and Haken, 1989Column length: 25. m; Column diameter: 0.32 mm
CapillarySE-30180.1410.Tarjan, Nyiredy, et al., 1989
CapillaryOV-101160.1377.Haken and Korhonen, 1983N2; Column length: 25. m; Column diameter: 0.22 mm
CapillaryOV-101180.1410.Haken and Korhonen, 1983N2; Column length: 25. m; Column diameter: 0.22 mm

Kovats' RI, polar column, isothermal

View large format table.

Column type Active phase Temperature (C) I Reference Comment
CapillaryOV-351160.2072.Evans and Haken, 1989Column length: 25. m; Column diameter: 0.32 mm

References

Evans and Haken, 1989
Evans, M.B.; Haken, J.K., Dispersion and selectivity indices in gas chromatography. IV. Chlorinated aromatic compounds, J. Chromatogr., 1989, 468, 373-382, https://doi.org/10.1016/S0021-9673(00)96332-5 . [all data]

Tarjan, Nyiredy, et al., 1989
Tarjan, G.; Nyiredy, Sz.; Gyor, M.; Lombosi, E.R.; Lombosi, T.S.; Budahegyi, M.V.; Meszaros, S.Y.; Takacs, J.M., Review. Thirtieth Anniversary of the Retention Index According to Kovats in Gas-Liquid Chromatography, J. Chromatogr., 1989, 472, 1-92, https://doi.org/10.1016/S0021-9673(00)94099-8 . [all data]

Haken and Korhonen, 1983
Haken, J.K.; Korhonen, I.O.O., Gas chromatography of homologous esters. XXI. Capillary column studies of the chlorinated phenyl acetates, J. Chromatogr., 1983, 257, 267-273, https://doi.org/10.1016/S0021-9673(01)88182-6 . [all data]