Pyrimidine, tetrachloro-

Phase change data

Data compiled by: William E. Acree, Jr., James S. Chickos

Quantity Value Units Method Reference Comment
Δsub19.8 ± 0.24kcal/molCRibeiro da Silva, Amaral, et al., 2007

References

Ribeiro da Silva, Amaral, et al., 2007
Ribeiro da Silva, Manuel A.V.; Amaral, Luísa M.P.F.; Gomes, José R.B., Comparative Computational and Experimental Study on the Thermochemistry of the Chloropyrimidines, J. Phys. Chem. B, 2007, 111, 4, 792-799, https://doi.org/10.1021/jp0664723 . [all data]