Tetracobalt dodecacarbonyl

Gas phase ion energetics data

Data compiled as indicated in comments:
LBLHLM - Sharon G. Lias, John E. Bartmess, Joel F. Liebman, John L. Holmes, Rhoda D. Levin, and W. Gary Mallard
LLK - Sharon G. Lias, Rhoda D. Levin, and Sherif A. Kafafi

Ionization energy determinations

IE (eV) Method Reference Comment
7.45PEDeKock, Wong, et al., 1982LBLHLM
7.8PEGreen, Mingos, et al., 1981LLK
8.9PEGreen, Mingos, et al., 1981Vertical value; LLK

Phase change data

Data compiled by: William E. Acree, Jr., James S. Chickos

Quantity Value Units Method Reference Comment
Δsub23.0 ± 1.0kcal/molN/APilcher and Skinner, 1983See also Connor, Skinner, et al., 1973.

References

DeKock, Wong, et al., 1982
DeKock, R.L.; Wong, K.S.; Fehlner, T.P., Effects of bridging hydrogens on metal-netal bonds. 2. UV photoelectron and UV-visible spectra and quantum chemical calculations for Fe3(μ-H)3(CO)93-CCH3) and Co3(CO)93-CCH3), Inorg. Chem., 1982, 21, 3203. [all data]

Green, Mingos, et al., 1981
Green, J.C.; Mingos, D.M.P.; Seddon, E.A., Ultraviolet photoelectron studies on bonding in some metal carbonyl and metal hydrido carbonyl clusters, Inorg. Chem., 1981, 20, 2595. [all data]