2-Butene, 2-chloro-3-methyl-

Reaction thermochemistry data

Data compiled by: Hussein Y. Afeefy, Joel F. Liebman, and Stephen E. Stein

Individual Reactions

Butane, 2,3-dichloro-2-methyl- = 2-Butene, 2-chloro-3-methyl- + Hydrogen chloride

By formula: C5H10Cl2 = C5H9Cl + HCl

Quantity Value Units Method Reference Comment
Δr68. ± 1.kJ/molEqkMeged, Levanova, et al., 1980gas phase
Δr68.2 ± 4.2kJ/molEqkMeged, Levanova, et al., 1980gas phase

Normal alkane RI, non-polar column, isothermal

View large format table.

Column type Active phase Temperature (C) I Reference Comment
CapillarySqualane30.698.Tourres, 1968Nitrogen; Column length: 50. m; Column diameter: 0.25 mm
CapillarySqualane50.700.Tourres, 1968Nitrogen; Column length: 50. m; Column diameter: 0.25 mm

References

Meged, Levanova, et al., 1980
Meged, V.M.; Levanova, S.V.; Rozhnov, A.M., Dehydrohalogenation of dihalomethylbutanes. 2., Izv. Vyssh. Uchebn. Zaved., Khim. Khim. Tekhnol., 1980, 23, 149-151. [all data]