Benzene, 1-methyl-3-(1-methylpropyl)

Phase change data

Data compiled by: Thermodynamics Research Center, NIST Boulder Laboratories, Chris Muzny director

Quantity Value Units Method Reference Comment
Tboil468.KN/ABarkenbus, Hopkins, et al., 1939Uncertainty assigned by TRC = 5. K
Tboil469.KN/AShoesmith and McGechen, 1930Uncertainty assigned by TRC = 6. K

In addition to the Thermodynamics Research Center (TRC) data available from this site, much more physical and chemical property data is available from the following TRC products:

References

Barkenbus, Hopkins, et al., 1939
Barkenbus, C.; Hopkins, R.L.; Allen, J.F., J. Am. Chem. Soc., 1939, 61, 2452. [all data]

Shoesmith and McGechen, 1930
Shoesmith; McGechen, J. Chem. Soc., 1930, 1930, 2231. [all data]