Bicyclo[3.1.1]hept-2-ene, 2,6-dimethyl-6-(4-methyl-3-pentenyl)-

Van Den Dool and Kratz RI, non-polar column, temperature ramp

Data compiled by: NIST Mass Spectrometry Data Center, William E. Wallace, director

Column type CapillaryCapillaryCapillaryCapillaryCapillary
Active phase HP-101HP-5MSDB-5Optima 5SPB-5
Column length (m) 25.30.25.25.30.
Carrier gas HeH2N2HeHe
Substrate
Column diameter (mm) 0.20.250.250.250.25
Phase thickness (μm) 0.20.250.250.250.25
Tstart (C) 70.50.75.60.60.
Tend (C) 200.285.210.280.250.
Heat rate (K/min) 3.4.33.3.4.
Initial hold (min) 2. 10. 2.
Final hold (min) 15. 1.20.20.
I 1407.1430.1414.1425.1415.
ReferencePoliteo, Jukic, et al., 2007Vujisic L., Vuckovic I., et al., 2006bin Jantan, Yalvema, et al., 2005Chosson, Vérité, et al., 2003Pino, Marbot, et al., 2002
Comment MSDC-RI MSDC-RI MSDC-RI MSDC-RI MSDC-RI
Column type CapillaryCapillaryCapillaryCapillaryCapillary
Active phase HP-5Methyl SiliconeOV-1DB-1OV-101
Column length (m) 30.50.25.60.50.
Carrier gas HeN2H2HeN2
Substrate
Column diameter (mm) 0.250.250.250.250.25
Phase thickness (μm) 0.250.170.30.25
Tstart (C) 50.80.50.70.80.
Tend (C) 280.200.200.250.200.
Heat rate (K/min) 4.2.3.2.52.
Initial hold (min) 5. 1.5.
Final hold (min)   20.15.
I 1430.1438.1422.1436.1436.
ReferenceLazari, Skaltsa, et al., 1999Sumathykutty, Rao, et al., 1999Bicchi, Fresia, et al., 1997Combariza, Tirado, et al., 1994Yang, Sugisawa, et al., 1992
Comment MSDC-RI MSDC-RI MSDC-RI MSDC-RI MSDC-RI
Column type CapillaryCapillaryCapillary
Active phase OV-101OV-1OV-1
Column length (m) 50.30.30.
Carrier gas N2HeHe
Substrate
Column diameter (mm) 0.250.50.5
Phase thickness (μm)  0.80.8
Tstart (C) 80.40.40.
Tend (C) 200.220.220.
Heat rate (K/min) 2.2.2.
Initial hold (min)
Final hold (min)
I 1438.1425.1432.
ReferenceYang, Sugisawa, et al., 1992De Pooter, Omar, et al., 1985De Pooter, Omar, et al., 1985
Comment MSDC-RI MSDC-RI MSDC-RI

Van Den Dool and Kratz RI, polar column, temperature ramp

Data compiled by: NIST Mass Spectrometry Data Center, William E. Wallace, director

Column type CapillaryCapillaryCapillaryCapillary
Active phase HP-20MDB-WaxCarbowax 20MDB-Wax
Column length (m) 50.60.25.60.
Carrier gas HeHe He
Substrate
Column diameter (mm) 0.20.320.250.25
Phase thickness (μm) 0.20.250.30.25
Tstart (C) 70.35.50.50.
Tend (C) 180.220.200.150.
Heat rate (K/min) 4.3.3.2.
Initial hold (min) 4. 1.10.
Final hold (min) 15. 20.20.
I 1564.1584.1586.1566.
ReferencePoliteo, Jukic, et al., 2007Pala-Paul, Copeland, et al., 2006Bicchi, Fresia, et al., 1997Combariza, Tirado, et al., 1994
Comment MSDC-RI MSDC-RI MSDC-RI MSDC-RI

Kovats' RI, non-polar column, isothermal

Data compiled by: NIST Mass Spectrometry Data Center, William E. Wallace, director

Column type Capillary
Active phase DB-1
Column length (m) 28.
Carrier gas He
Substrate
Column diameter (mm) 0.25
Phase thickness (μm) 0.25
Temperature (C) 150.
I 1434.
ReferenceViswanathan, Maridass, et al., 2002
Comment MSDC-RI

Normal alkane RI, polar column, temperature ramp

Data compiled by: NIST Mass Spectrometry Data Center, William E. Wallace, director

Column type CapillaryCapillaryCapillaryCapillaryCapillary
Active phase CP-Wax 52CBTC-FFAPDB-WaxDB-WaxDB-Wax
Column length (m) 30. 60.60.60.
Carrier gas HeHe  N2
Substrate
Column diameter (mm) 0.320.250.250.250.25
Phase thickness (μm) 0.250.250.250.250.25
Tstart (C) 40.60.70.70.70.
Tend (C) 220.220.230.230.230.
Heat rate (K/min) 3.3.2.2.2.
Initial hold (min) 1. 2.2.2.
Final hold (min) 2.30.20.20.20.
I 1592.1587.1575.1589.1588.
ReferenceHymete, Rohloff, et al., 2007Kurose, Okamura, et al., 2007Sawamura, Onishi, et al., 2006Sawamura, Onishi, et al., 2006Choi, 2004
Comment MSDC-RI MSDC-RI MSDC-RI MSDC-RI MSDC-RI
Column type CapillaryCapillaryCapillaryCapillaryCapillary
Active phase DB-WaxDB-WaxDB-WaxInnowaxDB-Wax
Column length (m) 60.60.60.60.60.
Carrier gas N2 NitrogenHeN2
Substrate
Column diameter (mm) 0.250.250.250.250.25
Phase thickness (μm) 0.250.250.25 0.25
Tstart (C) 70.70.70.60.70.
Tend (C) 230.230.230.220.230.
Heat rate (K/min) 2.2.2.4.2.
Initial hold (min) 2.2.2.10.2.
Final hold (min) 20.20. 10.20.
I 1583.1603.1603.1545.1558.
ReferenceChoi, 2004, 2Sawamura, Son, et al., 2004Sawamura, Sou, et al., 2004Suleimenov, Atazharova, et al., 2003Tu, Onishi, et al., 2003
Comment MSDC-RI MSDC-RI MSDC-RI MSDC-RI MSDC-RI
Column type CapillaryCapillaryCapillaryCapillaryCapillary
Active phase RTX-WaxPEG-20MCarbowaxTC-WaxCarbowax 20M
Column length (m) 60.60.50.60.60.
Carrier gas HeN2N2 He
Substrate
Column diameter (mm) 0.250.250.20.250.25
Phase thickness (μm) 0.5   0.25
Tstart (C) 40.70.80.80.50.
Tend (C) 180.220.200.240.150.
Heat rate (K/min) 5.3.1.3.2.
Initial hold (min) 5.  5.10.
Final hold (min) 20. 20. 20.
I 1592.1597.1590.1569.1589.
ReferenceGalindo-Cuspinera, Lubran, et al., 2002Hirose, Joichi, et al., 1999Menon, Chacko, et al., 1999Shuichi, Masazumi, et al., 1996Tirado, Stashenko, et al., 1995
Comment MSDC-RI MSDC-RI MSDC-RI MSDC-RI MSDC-RI
Column type CapillaryCapillary
Active phase Carbowax 20MCarbowax 20M
Column length (m) 150.150.
Carrier gas He
Substrate
Column diameter (mm) 0.640.64
Phase thickness (μm)
Tstart (C) 50.50.
Tend (C) 170.170.
Heat rate (K/min) 1.1.
Initial hold (min) 10.30.
Final hold (min) 60.
I 1570.1610.
ReferenceSeifert and King, 1982Buttery and Kamm, 1980
Comment MSDC-RI MSDC-RI

Kovats' RI, non-polar column, temperature ramp

Data compiled by: NIST Mass Spectrometry Data Center, William E. Wallace, director

Column type CapillaryCapillaryCapillaryCapillaryCapillary
Active phase DB-1HP-5MSSPB-1HP-5BP-1
Column length (m) 30.30.30.30.25.
Carrier gas HeHeHeHeN2
Substrate
Column diameter (mm) 0.250.250.320.250.32
Phase thickness (μm) 0.250.250.250.250.25
Tstart (C) 50.60.50.60.60.
Tend (C) 280.200.250.200.220.
Heat rate (K/min) 5.4.2.4.5.
Initial hold (min) 3.1.2.1.
Final hold (min)  15.5.15.15.
I 1435.1433.1434.1436.1440.
ReferenceAllegrone, Belliardo, et al., 2006Juliani, Zygadlo, et al., 2004Yadav, Chauhan, et al., 2004Juliani and Simon, 2002Raina, Srivastava, et al., 2002
Comment MSDC-RI MSDC-RI MSDC-RI MSDC-RI MSDC-RI
Column type CapillaryCapillaryCapillaryCapillaryCapillary
Active phase BP-1DB-1HP-5MSSE-30DB-1
Column length (m) 30.28.30.25.28.
Carrier gas N2HeHeN2He
Substrate
Column diameter (mm) 0.320.250.320.20.25
Phase thickness (μm) 0.250.250.25 0.25
Tstart (C) 60.50.70.60.50.
Tend (C) 220.270.250.180.270.
Heat rate (K/min) 5.4.53.3.4.
Initial hold (min)  1.5.10.1.
Final hold (min) 13.  1.
I 1422.1434.1428.1430.1434.
ReferenceShawl, Srivastava, et al., 2002Nagalakshmi, Thangadurai, et al., 2001Siani, Ramos, et al., 1999Jantan, Ahmad, et al., 1996Saad, El-Sharkawy, et al., 1995
Comment MSDC-RI MSDC-RI MSDC-RI MSDC-RI MSDC-RI

Normal alkane RI, polar column, custom temperature program

Data compiled by: NIST Mass Spectrometry Data Center, William E. Wallace, director

Column type CapillaryCapillaryCapillaryCapillaryCapillary
Active phase Supelcowax-10HP-Innowax FSCHP-Innowax FSCCarbowax 20MInnowax FSC
Column length (m) 30.60.60. 60.
Carrier gas HeN2He He
Substrate
Column diameter (mm) 0.250.250.25 0.25
Phase thickness (μm) 0.250.250.25 0.25
Program 40C(3min) => 4C/min => 75C => 8C/min => 250C(5min)60C(10min) => 4C/min => 220C(10min) => 1C/min => 240C60C(10min) => 4C/min => 220C(10min) => 1C/min => 240Cnot specified60C(10min) => 4C/min => 220C (10min) => 1C/min => 240C
I 1595.1572.1545.1570.1572.
ReferenceVichi, Guadayol, et al., 2007Tunalier, Candan, et al., 2006Tabanca, Demirci, et al., 2005Vinogradov, 2004Baser, Demirci, et al., 2003
Comment MSDC-RI MSDC-RI MSDC-RI MSDC-RI MSDC-RI
Column type Capillary
Active phase DB-Wax
Column length (m) 30.
Carrier gas He
Substrate
Column diameter (mm) 0.25
Phase thickness (μm) 0.25
Program 25C(8min) => 4C/min => 60C => 6C/min => 160C => 20C/min => 200C
I 1567.
ReferenceCaldentey, Daria Fumi, et al., 1998
Comment MSDC-RI

References

Politeo, Jukic, et al., 2007
Politeo, O.; Jukic, M.; Milos, M., Chemical composition and antioxidant capacity of free volatile aglycones from basil (Ocimum basilicum L.) compared with its essential oil, Food Chem., 2007, 101, 1, 379-385, https://doi.org/10.1016/j.foodchem.2006.01.045 . [all data]

Vujisic L., Vuckovic I., et al., 2006
Vujisic L.; Vuckovic I.; Tesevic V.; Dokovic D.; Ristic M.S.; Janackovic P.; Milosavljevic S., Comparative examination of the essential oils of Anthemis ruthenica and A-arvensis wild-growing in Serbia, Flavour Fragr. J., 2006, 21, 3, 458-461, https://doi.org/10.1002/ffj.1681 . [all data]

bin Jantan, Yalvema, et al., 2005
bin Jantan, I.; Yalvema, M.F.; Ayop, N.; Ahmad, A.S., Constituents of the essential oils of Cinnamomum sintoc Blume from a mountain forest of Peninsular Malaysia, Flavour Fragr. J., 2005, 20, 6, 601-604, https://doi.org/10.1002/ffj.1495 . [all data]

Chosson, Vérité, et al., 2003
Chosson, E.; Vérité, P.; Blanckaert, A.; Seguin, E.; Litaudon, M.; Sévenet, T., Non polar compounds from the bark of Sarcomelicope follicularis, Biochem. Syst. Ecol., 2003, 31, 10, 1185-1188, https://doi.org/10.1016/S0305-1978(03)00065-6 . [all data]

Pino, Marbot, et al., 2002
Pino, J.; Marbot, R.; Rosado, A., Volatile constituents of star apple (Chrysophyllum cainito L.) from Cuba, Flavour Fragr. J., 2002, 17, 5, 401-403, https://doi.org/10.1002/ffj.1116 . [all data]

Lazari, Skaltsa, et al., 1999
Lazari, D.M.; Skaltsa, H.D.; Constantinidis, T., Essential oils of Marrubium velutinum Sm. and Marrubium peregrinum L., growing wild in Greece, Flavour Fragr. J., 1999, 14, 5, 290-292, https://doi.org/10.1002/(SICI)1099-1026(199909/10)14:5<290::AID-FFJ828>3.0.CO;2-4 . [all data]

Sumathykutty, Rao, et al., 1999
Sumathykutty, M.A.; Rao, J.M.; Padmakumari, K.P.; Narayanan, C.S., Essential oil constituents of some Piper species, Flavour Fragr. J., 1999, 14, 5, 279-282, https://doi.org/10.1002/(SICI)1099-1026(199909/10)14:5<279::AID-FFJ821>3.0.CO;2-0 . [all data]

Bicchi, Fresia, et al., 1997
Bicchi, C.; Fresia, M.; Rubiolo, P.; Monti, D.; Franz, C.; Goehler, I., Constituents of Tagetes lucida Cav. ssp. lucida essential oil, Flavour Fragr. J., 1997, 12, 1, 47-52, https://doi.org/10.1002/(SICI)1099-1026(199701)12:1<47::AID-FFJ610>3.0.CO;2-7 . [all data]

Combariza, Tirado, et al., 1994
Combariza, M.Y.; Tirado, C.B.; Stashenko, E.; Shibamoto, T., Limonene concentration in lemon (Citrus volkameriana) peel oil as a function of ripeness, J. Hi. Res. Chromatogr., 1994, 17, 9, 643-646, https://doi.org/10.1002/jhrc.1240170905 . [all data]

Yang, Sugisawa, et al., 1992
Yang, R.; Sugisawa, H.; Nakatani, H.; Tamura, H.; Takagi, N., Comparison of odor quality in peel oils of acid citrus, Nippon Shokuhin Kogyo Gakkaishi, 1992, 39, 1, 16-24, https://doi.org/10.3136/nskkk1962.39.16 . [all data]

De Pooter, Omar, et al., 1985
De Pooter, H.L.; Omar, M.N.; Coolsaet, B.A.; Schamp, N.M., The Essential Oil of Greater Galanga (Alpinia Galanga) from Malaysia, Phytochemistry, 1985, 24, 1, 93-96, https://doi.org/10.1016/S0031-9422(00)80814-6 . [all data]