2-Phenylbicyclo[1,1,1]pentane-2-ol

Phase change data

Data compiled as indicated in comments:
TRC - Thermodynamics Research Center, NIST Boulder Laboratories, Chris Muzny director
ALS - Hussein Y. Afeefy, Joel F. Liebman, and Stephen E. Stein
DRB - Donald R. Burgess, Jr.

Quantity Value Units Method Reference Comment
Tfus348.75KN/AKozina, Pimenova, et al., 1985Uncertainty assigned by TRC = 0.5 K; TRC
Quantity Value Units Method Reference Comment
Δsub20.8 ± 0.26kcal/molCKozina, Pimenova, et al., 1985, 2ALS
Δsub20.8kcal/molN/AKozina, Pimenova, et al., 1985, 2DRB

In addition to the Thermodynamics Research Center (TRC) data available from this site, much more physical and chemical property data is available from the following TRC products:

References

Kozina, Pimenova, et al., 1985
Kozina, M.P.; Pimenova, S.M.; Lukyanova, V.A.; Surmina, L.S., Enthalpies of Combustion and Formation of 2-Phenylbicyclo[1.1.1] Pentan-2-ol and 3-Methyl-2-Phenylbutan-2-ol, Dokl. Akad. Nauk SSSR, 1985, 283, 3, 661. [all data]

Kozina, Pimenova, et al., 1985, 2
Kozina, M.P.; Pimenova, S.M.; Lukyanova, V.A.; Surmina, L.S., Enthalpies of combustion and formation of 2-phenylbicyclo[1,1,1]pentane-2-ol and 3-methyl-2-phenyl-butane-2-ol, Dokl. Phys. Chem. (Engl. Transl.), 1985, 283, 713-715. [all data]