C10H14

Reaction thermochemistry data

Data compiled by: John E. Bartmess

Individual Reactions

C10H13- + Hydrogen cation = C10H14

By formula: C10H13- + H+ = C10H14

Quantity Value Units Method Reference Comment
Δr369.1 ± 2.5kcal/molG+TSMishima, Kinoshita, et al., 2002gas phase; Reprotonation likely to be on C-1, giving 1-alkyl-cycloheptatriene - JEB
Quantity Value Units Method Reference Comment
Δr361.4 ± 2.0kcal/molIMREMishima, Kinoshita, et al., 2002gas phase; Reprotonation likely to be on C-1, giving 1-alkyl-cycloheptatriene - JEB

References

Mishima, Kinoshita, et al., 2002
Mishima, M.; Kinoshita, T.; Hattori, Y.; Takeuchi, K., Gas-phase acidities of cycloheptatrienes: effects of alkyl groups on the stability of carbanions, Eur. J. Mass Spectrom., 2002, 8, 1, 359-366, https://doi.org/10.1255/ejms.499 . [all data]