Furyl hydroxymethyl ketone

Normal alkane RI, polar column, custom temperature program

Data compiled by: NIST Mass Spectrometry Data Center, William E. Wallace, director

Column type CapillaryCapillary
Active phase StabilwaxBP-20
Column length (m) 30.30.
Carrier gas HeliumHe
Substrate
Column diameter (mm) 0.250.25
Phase thickness (μm) 0.250.25
Program 35 0C 3 0C/min -> 100 0C 5 0C/min -> 240 0C (10 min)50C(1min) => 2.5C/min => 100C => 2C/min => 180C => 15C/min => 220C
I 2019.1984.
ReferenceChinnici, Guerrero, et al., 2009Pontes, Marques, et al., 2007
Comment MSDC-RI MSDC-RI

Van Den Dool and Kratz RI, polar column, temperature ramp

Data compiled by: NIST Mass Spectrometry Data Center, William E. Wallace, director

Column type Capillary
Active phase DB-Wax
Column length (m) 60.
Carrier gas He
Substrate
Column diameter (mm) 0.25
Phase thickness (μm) 0.25
Tstart (C) 50.
Tend (C) 230.
Heat rate (K/min) 3.
Initial hold (min)
Final hold (min)
I 2001.
ReferenceShimoda, Wu, et al., 1996
Comment MSDC-RI

References

Chinnici, Guerrero, et al., 2009
Chinnici, F.; Guerrero, E.D.; Sonni, F.; Natali, N.; Marin, R.N.; Riponi, C., Gas chromatography - mass spectrometry (GC-MS) characterization of volatile compounds in quality vinegars with protected Europian geographical indication, J. Agric. Food Chem., 2009, 57, 11, 4784-4792, https://doi.org/10.1021/jf804005w . [all data]

Pontes, Marques, et al., 2007
Pontes, M.; Marques, J.C.; Camara, J.S., Screening of volatile composition from Portuguese multifloral honeys using headspace solid-phase microextraction-gas chromatography-quadrupole mass spectrometry, Talanta, 2007, 74, 1, 91-103, https://doi.org/10.1016/j.talanta.2007.05.037 . [all data]