Cyclopenta[c]pyran-1(3H)-one, hexahydro-4,7-dimethyl-, (4α,4aα,7α,7aα)-

Normal alkane RI, non-polar column, temperature ramp

Data compiled by: NIST Mass Spectrometry Data Center, William E. Wallace, director

Column type CapillaryCapillary
Active phase HP-1OV-1
Column length (m) 30.50.
Carrier gas N2He
Substrate
Column diameter (mm) 0.530.20
Phase thickness (μm) 0.880.20
Tstart (C) 60.30.
Tend (C) 300.220.
Heat rate (K/min) 8.2.
Initial hold (min)
Final hold (min) 15.
I 1393.1370.
ReferenceMalizia, Molli, et al., 1996de Pooter, Nicolai, et al., 1988
Comment MSDC-RI MSDC-RI

References

Malizia, Molli, et al., 1996
Malizia, R.A.; Molli, J.S.; Cardell, D.A.; Retamar, J.A., Volatile constituents of the essential oil of Nepeta cataria L. grown in Cordoba Province (Argentina), J. Essent. Oil Res., 1996, 8, 5, 565-567, https://doi.org/10.1080/10412905.1996.9700691 . [all data]

de Pooter, Nicolai, et al., 1988
de Pooter, H.L.; Nicolai, B.; De Laet, J.; De Buyck, L.F.; Schamp, N.M.; Goetghebeur, P., The Essential Oils of Five Nepeta Species. A Preliminary Evaluation of their Use in Chemotaxonomy by Cluster Analysis, Flavour Fragr. J., 1988, 3, 4, 155-159, https://doi.org/10.1002/ffj.2730030404 . [all data]