Perfluorotetracosane

Phase change data

Data compiled as indicated in comments:
TRC - Thermodynamics Research Center, NIST Boulder Laboratories, Chris Muzny director
AC - William E. Acree, Jr., James S. Chickos

Quantity Value Units Method Reference Comment
Tfus465.2KN/AStarkweather, 1986Uncertainty assigned by TRC = 0.1 K; TRC

Enthalpy of fusion

ΔfusH (kJ/mol) Temperature (K) Method Reference Comment
100.8465.2DSCStarkweather, 1986, 2AC

In addition to the Thermodynamics Research Center (TRC) data available from this site, much more physical and chemical property data is available from the following TRC products:

References

Starkweather, 1986
Starkweather, H.W., Jr., Melting and crystalline transitions in normal perfluoroalkanes and poly(tetrafluoroethylene), Marcomolecules, 1986, 19, 4, 1131, https://doi.org/10.1021/ma00158a034 . [all data]

Starkweather, 1986, 2
Starkweather, Howard W., Melting and crystalline transitions in normal perfluoroalkanes and poly(tetrafluoroethylene), Macromolecules, 1986, 19, 4, 1131-1134, https://doi.org/10.1021/ma00158a034 . [all data]