Methyl trichloropropenoate

Kovats' RI, non-polar column, isothermal

View large format table.

Column type Active phase Temperature (C) I Reference Comment
CapillarySE-30100.1023.Haken and Korhonen, 1983Column length: 25. m; Column diameter: 0.22 mm
CapillarySE-3080.1022.Haken and Korhonen, 1983Column length: 25. m; Column diameter: 0.22 mm

Kovats' RI, polar column, isothermal

View large format table.

Column type Active phase Temperature (C) I Reference Comment
CapillaryOV-351100.1500.Haken and Korhonen, 1983Column length: 25. m; Column diameter: 0.32 mm
CapillaryOV-35180.1484.Haken and Korhonen, 1983Column length: 25. m; Column diameter: 0.32 mm

Normal alkane RI, non-polar column, temperature ramp

View large format table.

Column type Active phase I Reference Comment
CapillaryHP-11028.Peters, de Leer, et al., 199425. m/0.2 mm/0.33 μm, He, 50. C @ 5. min, 8. K/min, 300. C @ 10. min

References

Haken and Korhonen, 1983
Haken, J.K.; Korhonen, I.O.O., Gas chromatography of homologous esters. XXIII. Capillary column studies of chlorinated methyl propenoates, J. Chromatogr., 1983, 268, 511-514, https://doi.org/10.1016/S0021-9673(01)95451-2 . [all data]

Peters, de Leer, et al., 1994
Peters, R.J.D.; de Leer, E.W.B.; Versteegh, J.F.M., Identification of Halogenated Compounds Produced by Chlorination of Humic Acid in the Presence of Bromide, J. Chromatogr. A, 1994, 686, 2, 253-261, https://doi.org/10.1016/0021-9673(94)00719-5 . [all data]