C9H10O2S

Reaction thermochemistry data

Data compiled by: John E. Bartmess

Individual Reactions

C9H9O2S- + Hydrogen cation = C9H10O2S

By formula: C9H9O2S- + H+ = C9H10O2S

Quantity Value Units Method Reference Comment
Δr361.3 ± 2.3kcal/molG+TSCumming and Kebarle, 1978gas phase
Quantity Value Units Method Reference Comment
Δr354.9 ± 2.0kcal/molIMRECumming and Kebarle, 1978gas phase

References

Cumming and Kebarle, 1978
Cumming, J.B.; Kebarle, P., Summary of gas phase measurements involving acids AH. Entropy changes in proton transfer reactions involving negative ions. Bond dissociation energies D(A-H) and electron affinities EA(A), Can. J. Chem., 1978, 56, 1. [all data]