Trisulfide, methyl propyl

Kovats' RI, non-polar column, isothermal

View large format table.

Column type Active phase Temperature (C) I Reference Comment
CapillaryOV-101130.1146.Misharina and Golovnya, 1989He; Column length: 50. m; Column diameter: 0.32 mm

Van Den Dool and Kratz RI, non-polar column, temperature ramp

View large format table.

Column type Active phase I Reference Comment
CapillaryDB-11130.Pino, Fuentes, et al., 2001He, 60. C @ 4. min, 4. K/min; Column length: 30. m; Column diameter: 0.32 mm; Tend: 250. C
CapillaryUltra-11118.1Farkas, Hradský, et al., 199225. m/0.2 mm/0.33 μm, H2, 2. K/min; Tstart: 60. C; Tend: 230. C
CapillaryHP-11130.Kuo and Ho, 199250. m/0.32 mm/1.05 μm, He, 2. K/min; Tstart: 40. C; Tend: 260. C
CapillaryHP-11134.Kuo and Ho, 1992, 250. m/0.32 mm/1.05 μm, He, 2. K/min; Tstart: 40. C; Tend: 260. C
CapillaryOV-1011134.Misharina and Golovnya, 1989He, 4. K/min; Column length: 50. m; Column diameter: 0.32 mm; Tstart: 50. C; Tend: 250. C
CapillaryOV-11137.Schreyen, Dirinck, et al., 19761. K/min; Column length: 183. m; Column diameter: 0.762 mm; Tstart: 0. C; Tend: 230. C
CapillaryOV-11132.Schreyen, Dirinck, et al., 1976, 2N2, 1. K/min; Column length: 183. m; Tstart: 0. C; Tend: 230. C

Van Den Dool and Kratz RI, non-polar column, custom temperature program

View large format table.

Column type Active phase I Reference Comment
CapillaryHP-5MS1154.2Andriamaharavo, 201430. m/0.25 mm/0.25 μm, He; Program: 60C (1 min) => 5 C/min => 210C => 10 C/min => 280C (15 min)
CapillarySPB-11132.Mochizuki, Yamamoto, et al., 199830. m/0.32 mm/4.0 μm, N2; Program: 40 0C (10 min), 2 0C/min to 180 0C, 25 0C/min to 250 0C (5 min)

Van Den Dool and Kratz RI, polar column, temperature ramp

View large format table.

Column type Active phase I Reference Comment
CapillaryDB-Wax1531.Nielsen, Larsen, et al., 200430. m/0.25 mm/0.25 μm, He, 45. C @ 10. min, 6. K/min, 240. C @ 30. min
CapillaryDB-Wax1529.Cha, Kim, et al., 199860. m/0.25 mm/0.25 μm, 40. C @ 5. min, 3. K/min, 200. C @ 60. min
CapillaryDB-Wax1519.Cha, Kim, et al., 199830. m/0.32 mm/0.25 μm, He, 40. C @ 5. min, 6. K/min, 200. C @ 30. min
CapillaryHP-Innowax1576.Schulz, Krüger, et al., 199860. m/0.25 mm/0.5 μm, H2, 4. K/min; Tstart: 80. C; Tend: 220. C
CapillaryCP-Wax 52CB1523.Kim, Wu, et al., 1995N2, 60. C @ 4. min, 2. K/min, 200. C @ 30. min; Column length: 50. m; Column diameter: 0.25 mm

Normal alkane RI, non-polar column, temperature ramp

View large format table.

Column type Active phase I Reference Comment
CapillaryHP-5MS1168.Sadraei, Ghannadi, et al., 200330. m/0.25 mm/0.25 μm, He, 4. K/min; Tstart: 60. C; Tend: 275. C
CapillaryHP-11116.Lopes, Godoy, et al., 199725. m/0.32 mm/0.17 μm, H2, 5. K/min; Tstart: 40. C; Tend: 200. C
CapillaryDB-11143.Hanum, Sinha, et al., 199530. m/0.25 mm/0.25 μm, He, 5. K/min; Tstart: 35. C; Tend: 150. C
CapillaryDB-11097.Yu, Wu, et al., 199460. m/0.25 mm/1. μm, He, 40. C @ 5. min, 2. K/min, 260. C @ 60. min
CapillaryDB-51150.Sinha, Guyer, et al., 1992He, 2. K/min; Column length: 30. m; Column diameter: 0.2 mm; Tstart: 30. C; Tend: 200. C

Normal alkane RI, non-polar column, custom temperature program

View large format table.

Column type Active phase I Reference Comment
CapillaryHP-5 MS1137.Pyun and Shin, 200630. m/0.25 mm/0.25 μm; Program: 40 0C (3 min) 2 0C/min -> 150 0C 20 0C/min -> 220 0C (5 min)
CapillarySE-301134.Vinogradov, 2004Program: not specified

Normal alkane RI, polar column, temperature ramp

View large format table.

Column type Active phase I Reference Comment
CapillaryCP-Wax 52CB1539.Chyau, Lin, et al., 199750. m/0.32 mm/0.25 μm, He, 50. C @ 5. min, 1.5 K/min, 210. C @ 10. min

References

Misharina and Golovnya, 1989
Misharina, T.A.; Golovnya, R.V., Regularities of retention of a pseudohomologous series of dialkylpolysulfides in capillary gas chromatography, Zh. Anal. Khim., 1989, 44, 514-519. [all data]

Pino, Fuentes, et al., 2001
Pino, J.A.; Fuentes, V.; Correa, M.T., Volatile constituents of Chinese chive (Allium tuberosum Rottl. ex Sprengel) and Rakkyo (Allium chinense G. Don), J. Agric. Food Chem., 2001, 49, 3, 1328-1330, https://doi.org/10.1021/jf9907034 . [all data]

Farkas, Hradský, et al., 1992
Farkas, P.; Hradský, P.; Kovác, M., Novel flavour components identified in the steamn distillate of onion (Allium cepa L.), Z. Lebensm. Unters. Forsch., 1992, 195, 5, 459-462, https://doi.org/10.1007/BF01191718 . [all data]

Kuo and Ho, 1992
Kuo, M.-C.; Ho, C.-T., Volatile constituents of the distilled oils of Welsh onions (Allium fistulosum L. variety Maichuon) and scallions (Allium fistulosum L. variety Caespitosum), J. Agric. Food Chem., 1992, 40, 1, 111-117, https://doi.org/10.1021/jf00013a021 . [all data]

Kuo and Ho, 1992, 2
Kuo, M.-C.; Ho, C.-T., Volatile constituents of the solvent extracts of Welsh onions (Allium fistulosum L. variety Maichuon) and scallions (A. fistulosum L. variety caepitosum), J. Agric. Food Chem., 1992, 40, 10, 1906-1910, https://doi.org/10.1021/jf00022a036 . [all data]

Schreyen, Dirinck, et al., 1976
Schreyen, L.; Dirinck, P.; van Wassenhove, F.; Schamp, N., Analysis of leek volatiles by headspace condensation, J. Agric. Food Chem., 1976, 24, 6, 1147-1152, https://doi.org/10.1021/jf60208a023 . [all data]

Schreyen, Dirinck, et al., 1976, 2
Schreyen, L.; Dirinck, P.; van Wassenhove, F.; Schamp, N., Volatile flavor components of leek, J. Agric. Food Chem., 1976, 24, 2, 336-341, https://doi.org/10.1021/jf60204a056 . [all data]

Andriamaharavo, 2014
Andriamaharavo, N.R., Retention Data. NIST Mass Spectrometry Data Center., NIST Mass Spectrometry Data Center, 2014. [all data]

Mochizuki, Yamamoto, et al., 1998
Mochizuki, E.; Yamamoto, T.; Komiyama, Y.; Nakazawa, H., Identification of allium products using flame photometric detection gas chromatography and distribution patterns of volatile sulfur compounds, J. Agric. Food Chem., 1998, 46, 12, 5170-5176, https://doi.org/10.1021/jf9803076 . [all data]

Nielsen, Larsen, et al., 2004
Nielsen, G.S.; Larsen, L.M.; Poll, L., Formation of aroma compounds during long-term frozen storage of unblanched leek (Allium ampeloprasum Var. Bulga) as affected by packaging atmosphere and slice thickness, J. Agric. Food Chem., 2004, 52, 5, 1234-1240, https://doi.org/10.1021/jf0306183 . [all data]

Cha, Kim, et al., 1998
Cha, Y.J.; Kim, H.; Cadwallader, K.R., Aroma-active compounds in Kimchi during fermentation, J. Agric. Food Chem., 1998, 46, 5, 1944-1953, https://doi.org/10.1021/jf9706991 . [all data]

Schulz, Krüger, et al., 1998
Schulz, H.; Krüger, H.; Liebmann, J.; Peterka, H., Distribution of volatile sulfur compounds in an interspecific hybrid between onion (Allium cepa L.) and leek (Allium porrum L.), J. Agric. Food Chem., 1998, 46, 12, 5220-5224, https://doi.org/10.1021/jf9806208 . [all data]

Kim, Wu, et al., 1995
Kim, S.M.; Wu, C.M.; Kubota, K.; Kobayashi, A., Effect of soybean oil on garlic volatile compounds isoalted by distillation, J. Agric. Food Chem., 1995, 43, 2, 449-452, https://doi.org/10.1021/jf00050a036 . [all data]

Sadraei, Ghannadi, et al., 2003
Sadraei, H.; Ghannadi, A.; Malekshahi, K., Composition of the essential oil of Asa-foetida and its spasmolytic action, Saudi Pharmaceutical Journal, 2003, 11, 3, 136-140. [all data]

Lopes, Godoy, et al., 1997
Lopes, D.; Godoy, R.L.O.; Goncalves, S.L.; Koketsu, M.; Oliveira, A.M., Sulphur constituents of the essential oil of Nira (Allium tuberosum Rottl.) cultivated in Brazil, Flavour Fragr. J., 1997, 12, 4, 237-239, https://doi.org/10.1002/(SICI)1099-1026(199707)12:4<237::AID-FFJ644>3.0.CO;2-9 . [all data]

Hanum, Sinha, et al., 1995
Hanum, T.; Sinha, N.K.; Guyer, D.E.; Cash, J.N., Pyruvate and flavor development in macerated onions (Allium cepa L.) by γ-glutamyl transpeptidase and exogenous C-S lyase, Food Chem., 1995, 54, 2, 183-188, https://doi.org/10.1016/0308-8146(95)00027-G . [all data]

Yu, Wu, et al., 1994
Yu, T.-H.; Wu, C.-M.; Rosen, R.T.; Hartman, T.G.; Ho, C.-T., Volatile compounds in generated from thermal degradation of alliin and deoxyalliin in an aqueous solution, J. Agric. Food Chem., 1994, 42, 1, 146-153, https://doi.org/10.1021/jf00037a026 . [all data]

Sinha, Guyer, et al., 1992
Sinha, N.K.; Guyer, D.E.; Gage, D.A.; Lira, C.T., Supercritical carbon dioxide extraction of onion flavors and their analysis by gas chromatography-mass spectrometry, J. Agric. Food Chem., 1992, 40, 5, 842-845, https://doi.org/10.1021/jf00017a027 . [all data]

Pyun and Shin, 2006
Pyun, M.-S.; Shin, S., Antifungal effects of the volatile oils from Allium plants against Trichophyton species and synergism of the oils with ketoconazole, Phytomedicine, 2006, 13, 6, 394-400, https://doi.org/10.1016/j.phymed.2005.03.011 . [all data]

Vinogradov, 2004
Vinogradov, B.A., Production, composition, properties and application of essential oils, 2004, retrieved from http://viness.narod.ru. [all data]

Chyau, Lin, et al., 1997
Chyau, C.-C.; Lin, Y.-C.; Mau, J.-L., Storage stability of deep-fried shallot flavoring, J. Agric. Food Chem., 1997, 45, 8, 3211-3215, https://doi.org/10.1021/jf970109z . [all data]