Flurazepam

Kovats' RI, non-polar column, isothermal

Data compiled by: NIST Mass Spectrometry Data Center, William E. Wallace, director

Column type CapillaryCapillaryCapillaryCapillaryCapillary
Active phase SE-30BP-1DB-1BP-1BP-1
Column length (m)  25.30.25.25.
Carrier gas  N2N2N2N2
Substrate
Column diameter (mm)  0.220.530.220.53
Phase thickness (μm)  0.251.50.251.
Temperature (C) 250.250.250.275.275.
I 2771.2795.2771.2799.2814.
ReferenceDimov and Moskovkina, 1991Japp, Garthwaite, et al., 1988Japp, Garthwaite, et al., 1988Japp, Gill, et al., 1987Japp, Gill, et al., 1987
Comment MSDC-RI MSDC-RI MSDC-RI MSDC-RI MSDC-RI
Column type PackedCapillaryPackedPacked
Active phase SE-30SPB-1SE-30SE-30
Column length (m) 2.25. 1.5
Carrier gas N2HeN2N2
Substrate 1% se-30 on Anachrom ABS(80-100mesh)  Chromosorb G AW DMCS (80-100 mesh)
Column diameter (mm)  0.20
Phase thickness (μm)
Temperature (C) 260.250.280.280.
I 2759.2788.2800.2800.
ReferenceMusumarra, Scarlata, et al., 1987Lora-Tamayo, Rams, et al., 1986Schütz, 1982Schuetz and Westenberger, 1979
Comment MSDC-RI MSDC-RI MSDC-RI MSDC-RI

Kovats' RI, non-polar column, custom temperature program

Data compiled by: NIST Mass Spectrometry Data Center, William E. Wallace, director

Column type Packed
Active phase OV-101
Column length (m) 2.
Carrier gas N2
Substrate Chromosorb W
Column diameter (mm)
Phase thickness (μm)
Program not specified
I 2800.
ReferenceMcLinden and Stenhouse, 1979
Comment MSDC-RI

References

Dimov and Moskovkina, 1991
Dimov, N.; Moskovkina, M., New aspects of quantitative structure-retention relationships in chromatography, J. Chromatogr., 1991, 552, 59-69, https://doi.org/10.1016/S0021-9673(01)95923-0 . [all data]

Japp, Garthwaite, et al., 1988
Japp, M.; Garthwaite, K.; Geeson, A.V.; Osselton, M.D., Collection of Analytical Data for Benzodiazepines and Benzophenones, J. Chromatogr., 1988, 439, 2, 317-339, https://doi.org/10.1016/S0021-9673(01)83844-9 . [all data]

Japp, Gill, et al., 1987
Japp, M.; Gill, R.; Osselton, M.D., Comparison of drug retention indices determined on packed, wide bore capillary and narrow bore capillary columns, J. Forensic Sci., 1987, 32, 6, 1574-1586. [all data]

Musumarra, Scarlata, et al., 1987
Musumarra, G.; Scarlata, G.; Romano, G.; Cappello, G.; Clementi, S.; Giulietti, G., Qualitative organic analysis. Part 2. Identification of drugs by principal components analysis of standardized TLC data in four eluent systems and of retention indices on SE 30, J. Anal. Toxicol., 1987, 11, 4, 154-163, https://doi.org/10.1093/jat/11.4.154 . [all data]

Lora-Tamayo, Rams, et al., 1986
Lora-Tamayo, C.; Rams, M.A.; Chacon, J.M.R., Gas Chromatographic Data for 187 Nitrogen- or Phosphorus-Containing Drugs and Metabolites of Toxicological Interest Analysed on Methyl Silicone Capillary Columns, J. Chromatogr., 1986, 374, 73-85, https://doi.org/10.1016/S0378-4347(00)83254-5 . [all data]

Schütz, 1982
Schütz, H., Benzodiazepines, Springer-Verlag, New York, 1982, 438. [all data]

Schuetz and Westenberger, 1979
Schuetz, H.; Westenberger, V., Gas chromatographic data of 31 benzodiazepines and metabolites, J. Chromatogr., 1979, 169, 409-411, https://doi.org/10.1016/0021-9673(75)85071-0 . [all data]