Titanium fluoride oxide

Vibrational and/or electronic energy levels

Data compiled by: Marilyn E. Jacox

State:   X

Vib.
sym.
 No.   Approximate
 type of mode
 cm-1   Med.   Method   References

a' 1 TiO stretch 962.7 Ar IR Gong, Andrews, et al., 2012
3 TiF stretch 609.4 Ar IR Gong, Andrews, et al., 2012

References

Gong, Andrews, et al., 2012
Gong, Y.; Andrews, L.; Bauschlicher, C.W., Jr.; Thanthiriwatte, K.S.; Dixon, D.A., Infrared spectroscopic and theoretical studies of the OTiF2, OZrF2 and OHfF2 molecules with terminal oxo ligands, Dalton Trans., 2012, 41, 38, 11706, https://doi.org/10.1039/c2dt31223a . [all data]