Benzofuran, 2,3-dihydro-2-methyl-

Normal alkane RI, non-polar column, temperature ramp

View large format table.

Column type Active phase I Reference Comment
CapillaryZB-51306.Harrison and Priest, 200930. m/0.25 mm/0.25 μm, Helium, 40. C @ 1. min, 6. K/min, 280. C @ 9. min

Lee's RI, non-polar column, temperature ramp

View large format table.

Column type Active phase I Reference Comment
CapillaryHP-5184.6Shao, Wang, et al., 200630. m/0.3 mm/0.25 μm, He, 50. C @ 5. min, 5. K/min, 200. C @ 15. min

References

Harrison and Priest, 2009
Harrison, B.M.; Priest, F.G., Composition of peaks used in the preparation of malt for Scotch Whisky production - influence of geographical source and extraction depth, J. Agric. Food Chem., 2009, 57, 6, 2385-2391, https://doi.org/10.1021/jf803556y . [all data]

Shao, Wang, et al., 2006
Shao, X.; Wang, G.; Sun, Y.; Zhang, R.; Xie, K.; Liu, H., Determination and Characterization of the Pyrolysis Products of Isoprocarb by GC-MS, J. Chromatogr. Sci., 2006, 44, 3, 141-147, https://doi.org/10.1093/chromsci/44.3.141 . [all data]