1,3,2-Dioxaphosphorinane, 2-(dimethylamino)-
- Formula: C5H12NO2P
- Molecular weight: 149.1280
- IUPAC Standard InChIKey: ATORACUFQKQFMY-UHFFFAOYSA-N
- CAS Registry Number: 17454-25-0
- Chemical structure:

Gas phase ion energetics data

Data compiled as indicated in comments:
LLK - Sharon G. Lias, Rhoda D. Levin, and Sherif A. Kafafi
Ionization energy determinations
IE (eV) | Method | Reference | Comment |
---|---|---|---|
7.8 | PE | Zverev, Villem, et al., 1981 | LLK |
7.8 | PE | Arshinova, Zverev, et al., 1981 | LLK |
8.70 | PE | Zverev, Villem, et al., 1981 | Vertical value; LLK |
8.70 | PE | Arshinova, Zverev, et al., 1981 | Vertical value; LLK |

References

Zverev, Villem, et al., 1981
Zverev, V.V.; Villem, Y.Y.; Arshinova, R.P.,
Photoelectron spectra of di- and triesters of trivalent phosphorus,
Dokl. Akad. Nauk SSSR, 1981, 256, 1412. [all data]
Arshinova, Zverev, et al., 1981
Arshinova, R.P.; Zverev, V.V.; Villem, Y.Y.; Villem, N.V.,
Ionization potentials, electron structures, and steric structures of tervalent-phosphorus di-and tri-esters,
J. Gen. Chem. USSR, 1981, 51, 1503, In original 1757. [all data]