Butyl isobutyl sulfide

Kovats' RI, non-polar column, isothermal

View large format table.

Column type Active phase Temperature (C) I Reference Comment
PackedApiezon M130.1037.Garbuzov, Misharina, et al., 1985He or N2, Chromosorb W, AW-DMCS; Column length: 2.1 m

Normal alkane RI, non-polar column, custom temperature program

View large format table.

Column type Active phase I Reference Comment
CapillaryApiezon M1037.N/AProgram: not specified
CapillaryApiezon M1037.Liu, Cao, et al., 2005Program: not specified

References

Garbuzov, Misharina, et al., 1985
Garbuzov, V.G.; Misharina, T.A.; Aerov, A.F.; Golovnya, R.V., Gas chromatographic retention indices for sulphur(II)-containing organic substances, J. Anal. Chem. USSR (Engl. Transl.), 1985, 40, 4, 576-586. [all data]

Liu, Cao, et al., 2005
Liu, L.; Cao, C.-Z.; Xie, B.; Zou, L.-K., Research of QSSR on chromatography retention index of sulfides and mercaptans, Journal of Hunan University of Science and Technology, 2005, 20, 4, 74-80. [all data]