Dichlorofluoroammonia

Phase change data

Data compiled by: William E. Acree, Jr., James S. Chickos

Enthalpy of vaporization

ΔvapH (kJ/mol) Temperature (K) Reference Comment
25.7240.Sladkov and Novikova, 1996Based on data from 200. - 280. K.

References

Sladkov and Novikova, 1996
Sladkov, I.B.; Novikova, N.Yu., Physicochemical properties of some nitrogen halides, Zh. Prikl. Khim. (S.-Peterburg), 1996, 69, 11, 1840. [all data]