Ethyldichloroborane

Gas phase ion energetics data

Data compiled by: Henry M. Rosenstock, Keith Draxl, Bruce W. Steiner, and John T. Herron

Ionization energy determinations

IE (eV) Method Reference
10.8 ± 0.3EILappert, Pedley, et al., 1966

References

Lappert, Pedley, et al., 1966
Lappert, M.F.; Pedley, J.B.; Riley, P.N.K.; Tweedale, A., Ionisation potentials and electronic spectra of halogeno- and amino-boranes, and a study of some redistribution reactions, Chem. Commun., 1966, 788. [all data]