8,11,14-Eicosatrienoic acid, methyl ester

Kovats' RI, non-polar column, isothermal

Data compiled by: NIST Mass Spectrometry Data Center, William E. Wallace, director

Column type PackedPacked
Active phase SE-30SE-30
Column length (m) 1.51.5
Carrier gas He
Substrate Chromosorb W (80-100 mesh)Gas Chrom Q (80-100 mesh)
Column diameter (mm)
Phase thickness (μm)
Temperature (C) 200.200.
I 2249.2249.
ReferenceGolovnya and Kuzmenko, 1977Golovnya, Uralets, et al., 1976
Comment MSDC-RI MSDC-RI

References

Golovnya and Kuzmenko, 1977
Golovnya, R.V.; Kuzmenko, T.E., Thermodynamic evaluation of the interaction of fatty acid methyl esters with polar and non-polar stationary phases, based on their retention indices, Chromatographia, 1977, 10, 9, 545-548, https://doi.org/10.1007/BF02262915 . [all data]

Golovnya, Uralets, et al., 1976
Golovnya, R.V.; Uralets, V.P.; Kuzmenko, T.E., Characterization of fatty acid methyl esters by gas chromatography on siloxane liquid phases, J. Chromatogr., 1976, 121, 1, 118-121, https://doi.org/10.1016/S0021-9673(00)82312-2 . [all data]