Phosphorodiamidous fluoride, tetramethyl-

Gas phase ion energetics data

Data compiled by: Sharon G. Lias, Rhoda D. Levin, and Sherif A. Kafafi

Ionization energy determinations

IE (eV) Method Reference Comment
8.18PECowley, Dewar, et al., 1973Vertical value

References

Cowley, Dewar, et al., 1973
Cowley, A.H.; Dewar, M.J.S.; Goodman, D.W.; Schweiger, J.R., Stereochemical dependence of lone pair interactions in the photoelectron spectra of nitrogen-phosphorus compounds, J. Am. Chem. Soc., 1973, 95, 6506. [all data]