1H-Cyclopropa[a]naphthalene, 1a,2,3,5,6,7,7a,7b-octahydro-1,1,7,7a-tetramethyl-, [1aR-(1aα,7α,7aα,7bα)]-

Normal alkane RI, non-polar column, custom temperature program

Data compiled by: NIST Mass Spectrometry Data Center, William E. Wallace, director

Column type CapillaryCapillaryCapillaryCapillaryCapillary
Active phase 5 % Phenyl polydimethyl siloxaneZB-5ZB-5HP-5 MSDB-5
Column length (m)  30.30.30.30.
Carrier gas  NitrogenNitrogenHeliumHelium
Substrate
Column diameter (mm)  0.250.250.250.25
Phase thickness (μm)  0.250.250.250.25
Program not specifiednot specifiednot specified60 0C (1 min) 10 0C/min -> 180 0C (1 min) 20 0C/min -> 280 0C (15 min)not specified
I 1435.1467.1467.1432.1432.
ReferenceChaverri, Diaz, et al., 2011Vazques, Aimar, et al., 2011Vazquez, Demmel, et al., 2011Liu, Chu, et al., 2010Scherer, Wagner, et al., 2010
Comment MSDC-RI MSDC-RI MSDC-RI MSDC-RI MSDC-RI
Column type CapillaryCapillaryCapillaryCapillaryCapillary
Active phase DB-5HP-5HP-5HP-5 MSCP Sil 8 CB
Column length (m) 30.25.25.30.50.
Carrier gas HeliumHeliumHeliumHeliumHelium
Substrate
Column diameter (mm) 0.250.320.320.250.32
Phase thickness (μm) 0.250.170.170.250.25
Program 50 0C m6 0C/min -> 140 0C 5 0C/min -> 160 0C (1 min) 10 0C/min -> 200 0C60 0C (5 min) 4 0C/min -> 220 0C 11 0C/min -> 280 0C (15 min)not specified32 0C (1 min) 50 0C/min -> 115 0C 1.5 0C/min -> 145 0C 12 0C/min -> 240 0C (10 min)not specified
I 1436.1432.1433.1433.1432.
ReferenceCourtois, Paine, et al., 2009Custer, 2009Custer, 2009Zellner, Amorim, et al., 2009Kupcinskiene, Stikliene, et al., 2008
Comment MSDC-RI MSDC-RI MSDC-RI MSDC-RI MSDC-RI
Column type CapillaryCapillaryCapillaryCapillaryCapillary
Active phase SLB-5 MSHP-5HP-5DB-5 MSHP-5MS
Column length (m) 30.30.30.30.30.
Carrier gas HeliumHeliumHeliumHeliumHe
Substrate
Column diameter (mm) 0.250.250.250.250.25
Phase thickness (μm) 0.250.250.250.250.25
Program not specified40 0C (3 min) 3 0C/min -> 160 0C (2 min) 8 0C/min -> 220 0C (3 min)not specified45 0C (0.75 min) 10 0C/min -> 200 0C 30 0C/min -> 245 0C (1.25 min)40C(10min) => 3C/min => 200C => 2C/min => 220C
I 1434.1412.1427.1460.1432.
ReferenceLo Presti, Sciarrone, et al., 2008Qiao, Xie, et al., 2008Qiao, Xie, et al., 2008Cajka, Hajslova, et al., 2007Cole, Haber, et al., 2007
Comment MSDC-RI MSDC-RI MSDC-RI MSDC-RI MSDC-RI
Column type CapillaryCapillaryCapillaryCapillaryCapillary
Active phase DB-1DB-5 MSHP-5CP Sil 8 CBCP Sil 8 CB
Column length (m) 30.30. 30.50.
Carrier gas HeHelium HeHe
Substrate
Column diameter (mm) 0.250.25 0.250.32
Phase thickness (μm) 0.250.25 0.250.25
Program 45C => 3C/min => 175C => 15C/min => 300C (10min)60 0C 3 0C/min -> 210 0C 5 0C/min -> 250 0Cnot specified50C(3min) => 3C/min => 100C => 2.7C/min => 140C => 2.4C/min => 180C => 6C/min => 250C60 0C (2 min) 5 0C/min -> 160 0C 5 0C/min -> 250 0C (10 min)
I 1426.1458.1432.1429.1434.
ReferenceFerreira, Meireles de Sousa, et al., 2007Haznagy-Radnai, Szigle, et al., 2007Liolios, Laouer, et al., 2007Meekijjaroenroj, Bessière, et al., 2007Mockute, Bernotiene, et al., 2007
Comment MSDC-RI MSDC-RI MSDC-RI MSDC-RI MSDC-RI
Column type CapillaryCapillaryCapillaryCapillaryCapillary
Active phase HP-5 MSHP-5MSCP Sil 8 CBDB-1HP-5 MS
Column length (m) 30.30.50.30.
Carrier gas HeliumHeHeliumHe
Substrate
Column diameter (mm) 0.250.250.320.25
Phase thickness (μm) 0.250.250.250.25
Program 40 0C (10 min) 3 0C/min -> 200 0C 2 0C/min -> 220 0C40C(10min) => 3C/min => 200C => 2C/min => 220C60 0C (2 min) 5 0C/min -> 160 0C (1 min) 10 0C/min -> 280 0C (3 min)45C => 3C/min => 175C => 15C/min => 300C(10min)not specified
I 1430.1428.1434.1426.1429.
ReferenceMoriarity, Bansal, et al., 2007Moronkola, Ogunwande, et al., 2007Radusiene, Judzentiene, et al., 2007Rodrigues, Antunes, et al., 2007Stokes, Cole, et al., 2007
Comment MSDC-RI MSDC-RI MSDC-RI MSDC-RI MSDC-RI
Column type CapillaryCapillaryCapillaryCapillaryCapillary
Active phase HP-5MSPolydimethyl siloxaneHP-5MSHP-5MSDB-1
Column length (m) 30. 30.30.30.
Carrier gas He HeHeHe
Substrate
Column diameter (mm) 0.25 0.250.250.25
Phase thickness (μm)   0.250.25
Program 40C(10min) => 3C/min => 200C => 2C/min => 220Cnot specified50C(2min) => 6C/min => 200C => 10C/min => 270C(10min)50C(3min) => 3C/min => 150C(10min) => 10C/min => 250C35C => 4C/min => 180C => 10C/min => 250C
I 1432.1427.1423.1467.1434.
ReferenceTakaku, Haber, et al., 2007Werka, Boehme, et al., 2007Deng, Xu, et al., 2006Güllüce, Özer, et al., 2006de Lima, Maia, et al., 2006
Comment MSDC-RI MSDC-RI MSDC-RI MSDC-RI MSDC-RI
Column type CapillaryCapillaryCapillaryCapillaryCapillary
Active phase DB-5CP Sil 8 CBSPB-5HP-5 MSDB-1
Column length (m) 30.50.30.30.
Carrier gas HeHeHeliumHeliumHelium
Substrate
Column diameter (mm) 0.250.320.250.25
Phase thickness (μm) 0.250.250.100.25
Program 40C (5min) => 2C/min => 250C(15min) => 5C/min => 270C (10min)60 0C (2 min) 5 0C/min -> 160 0C 10 0C/min -> 250 0C (5 min)40 0C (1 min) 10 0C/min -> 120 0C 0.5 0C/min -> 150 0C 20 0C/min -> 280 0C (5 min)40 0C (10 min) 3 0C/min -> 200 0C 2 0C/min -> 220 0Cnot specified
I 1420.1434.1432.1429.1428.
ReferenceMassardo, Senatore, et al., 2006Mockute, Bernotiene, et al., 2006Navickiene, Morandim, et al., 2006Schmidt, Noletto, et al., 2006Soumaghi, Amin, et al., 2006
Comment MSDC-RI MSDC-RI MSDC-RI MSDC-RI MSDC-RI
Column type CapillaryCapillaryCapillaryCapillaryCapillary
Active phase DB-5CP Sil 8 CBHP-5MSHP-5MSDB-5
Column length (m) 30.50.30.30.30.
Carrier gas HeHeHeHeHe
Substrate
Column diameter (mm) 0.320.320.250.250.25
Phase thickness (μm) 0.250.250.250.250.25
Program 60C => 2C/min => 100C => 3C/min => 160C => 5C/min => 280C50C(5min) => 2C/min => 90C => 15C/min => 240C(4min)50C => 8C/min => 200C => 10C/min => 270C (5min)not specified40C(1min) => 9C/min => 130C => 2C/min => 230C
I 1428.1432.1463.1432.1427.
ReferenceSrivastava, Mallavarapu, et al., 2006Butkienë, Nivinskienë, et al., 2005Deng, Yao, et al., 2005Grombone-Guaratini, Silva-Brandão, et al., 2005Hamm, Bleton, et al., 2005
Comment MSDC-RI MSDC-RI MSDC-RI MSDC-RI MSDC-RI
Column type CapillaryCapillaryCapillaryCapillaryCapillary
Active phase CP Sil 8 CBMethyl SiliconeDB-5CP Sil 8 CBCP Sil 8 CB
Column length (m) 50. 30.50.50.
Carrier gas He HeHeHe
Substrate
Column diameter (mm) 0.32 0.250.320.32
Phase thickness (μm) 0.25 0.25 0.25
Program 60C(2min) => 5C/min => 160C(1min) => 10C/min => 250C (3min)not specified60C(4min) => 6C/min => 240 => 10C/min => 280C50 0C (2 min) 3 0C/min -> 180 0C (1 min) 20 0C/min -> 250 0C (2 min)50C(2min) => 3C/min => 180C(1min) => 20C/min => 250C (2min)
I 1432.1430.1432.1432.1432.
ReferenceRadudienë, Judpintienë, et al., 2005Couladis, Özcan, et al., 2004Letchamo, Ward, et al., 2004Mockutë, Bernotienë, et al., 2004Mockutë, Judbentienë, et al., 2004
Comment MSDC-RI MSDC-RI MSDC-RI MSDC-RI MSDC-RI
Column type CapillaryCapillaryCapillaryCapillaryCapillary
Active phase HP-5MSDB-5SE-30SE-30DB-5
Column length (m) 30.   30.
Carrier gas     He
Substrate
Column diameter (mm) 0.25   0.25
Phase thickness (μm) 0.25   0.25
Program 60C(1min) => 1.5C/min => 185C(1min) => 9C/min => 275C(2min)not specifiednot specifiednot specified40C (1min) => 9C/min => 130C => 2C/min => 230C
I 1432.1432.1425.1446.1427.
ReferenceSingh, Marimuthu, et al., 2004Vilaseca, Guy, et al., 2004Vinogradov, 2004Vinogradov, 2004Hamm, Lesellier, et al., 2003
Comment MSDC-RI MSDC-RI MSDC-RI MSDC-RI MSDC-RI
Column type CapillaryCapillaryCapillaryCapillaryCapillary
Active phase HP-5SE-54CP-Sil 8CB-MSCP-Sil 8CB-MSCP Sil 8 CB
Column length (m) 30.25.50.50.50.
Carrier gas HeH2 HeHe
Substrate
Column diameter (mm) 0.250.250.320.320.32
Phase thickness (μm) 0.250.25  0.25
Program 60C (4min) => 1C/min => 64C => 2.5C/min => 155C => 5C/min => 250C110C(2min) => 3C/min => 130C => 8.5C => 290C60C(1min) => 3C/min => 70C => 15C/min => 170C(8min) => 5C/min => 250C50C(2min) => 3C/min => 180C(1min) => 20C/min => 250C(2min)70C(5min) => 3C/min => 100C (1min) => 25C/min => 250C (10min)
I 1432.1417.1432.1432.1432.
ReferenceJordán, Martínez, et al., 2003Lima, Veiga, et al., 2003Mockute, Bernotiene, et al., 2003Mockute, Bernotiene, et al., 2003, 2Mockute and Judzentiene, 2003
Comment MSDC-RI MSDC-RI MSDC-RI MSDC-RI MSDC-RI
Column type CapillaryCapillaryCapillaryCapillaryCapillary
Active phase CP Sil 8 CBSE-30SE-30DB-5DB-5
Column length (m) 50.60.60.30.
Carrier gas HeHeHeHe
Substrate
Column diameter (mm) 0.320.250.250.25
Phase thickness (μm) 0.25  0.25
Program 60C(1min) => 5C/min => 160C => 10C/min => 250C(5min)50 0C (5 min) 5 0C/min -> 165 0C 4 0C/min -> 230 0Cnot specified35C => 4C/min => 180C => 20C/min => 280Cnot specified
I 1432.1387.1388.1428.1460.
ReferenceMockute, Nivinskiene, et al., 2003Li, Wu, et al., 2002Li, Wu, et al., 2002Viana, Andrade-Neto, et al., 2002Petrakis, Tsitsimpikou, et al., 2001
Comment MSDC-RI MSDC-RI MSDC-RI MSDC-RI MSDC-RI
Column type CapillaryCapillaryCapillaryCapillaryCapillary
Active phase SE-30CP Sil 5 CBDB-5Methyl SiliconeOV-101
Column length (m) 30.25.30.
Carrier gas HeliumHeHe
Substrate
Column diameter (mm) 0.250.390.25
Phase thickness (μm) 0.20 0.25
Program not specifiednot specified60C => 3C/min => 240C => 30C/min => 300Cnot specifiednot specified
I 1475.1439.1426.1425.1432.
ReferencePrikhod'ko, Klyuev, et al., 1999Weyerstahl, Marschall, et al., 1999Yusuf, Begum, et al., 1998Zenkevich, 1996Menut, Lamaty, et al., 1994
Comment MSDC-RI MSDC-RI MSDC-RI MSDC-RI MSDC-RI

References

Chaverri, Diaz, et al., 2011
Chaverri, C.; Diaz, C.; Cicco, J.F., Chemical analysis of essential oils from Ocotea gomezii W.C. Burger and Ocotea morae Gomez-Laur. (Lauraceae) collected at Reserva biologica Alberto M. Brenes in Costa Rica and their cytotoxic activity on Tumor cell lines, J. Braz. Chem. Soc., 2011, 22, 4, s1-s4, https://doi.org/10.1590/S0103-50532011000400018 . [all data]

Vazques, Aimar, et al., 2011
Vazques, A.M.; Aimar, M.L.; Demmel, G.I.; Criado, S.G.; Ruiz, G.M.; Cantero, J.J.; Rossi, L.I.; Velasco, M.I., Determination of volatile organic compounds of Tagetes argentina Cabrera (asteraceae) using HS-SPME analysis, Boletin Latinoamericano y del Caribe Plantas Medicinales y Aromaticas, 2011, 10, 5, 463-469. [all data]

Vazquez, Demmel, et al., 2011
Vazquez, A.M.; Demmel, G.I.; Criado, S.G.; Aimar, M.L.; Cantero, J.; Rossi, L.I.; Velasco, M.I., Phytochemistry of TAgetes minuta L. (Asteraceae) from Cordoba, Argentina: comparative study between essential oil and HS-SPME analyses, Boletin Latinoamericano y del Caribe Plantas Medicinales y Aromaticas, 2011, 10, 4, 351-362. [all data]

Liu, Chu, et al., 2010
Liu, Z.L.; Chu, S.S.; Liu, Q.R., Chemical composition and insecticidial activity against Sitophilus zeamais of the essential oils of Artemisia capillaris and Artemisia mongolica, Molecules, 2010, 15, 4, 2600-2608, https://doi.org/10.3390/molecules15042600 . [all data]

Scherer, Wagner, et al., 2010
Scherer, R.; Wagner, R.; Meireles, M.A.A.; Godoy, H.T.; Duarte, M.C.T.; Filho, J.T., Biological activity and chemical composition of hydrodistilled and supercritical extracts of Xanthium strumarium L. leaves, J. Essen. Oil. Res., 2010, 22, 5, 424-429, https://doi.org/10.1080/10412905.2010.9700363 . [all data]

Courtois, Paine, et al., 2009
Courtois, E.A.; Paine, C.E.; Blandinieres, P.-A.; Stien, D.; Bessiere, J.-M.; Houel, E.; Baraloto, C.; Chave, J., Diversity of the volatile organic compounds emitted by 55 species of tropical trees: a survey in French Guiana, J. Chem. Ecol., 2009, 35, 11, 1349-1362, https://doi.org/10.1007/s10886-009-9718-1 . [all data]

Custer, 2009
Custer, Y., GC Volatile Components Analysis of Different Parts of Litchi chinensis (Dissertation), 2009. [all data]

Zellner, Amorim, et al., 2009
Zellner, B.D.; Amorim, A.C.L.; de Miranda A.L.P.; Alves, R.J.V.; Barbosa, J.P.; da Costa, G.L.; Rezende, C.M., Screening of the odor-activity and bioactiovity of the essential oils of leaves and flowers of Hyptis Passerina Mart. from the Brazilian Cerrado, J. Braz. Chem. Soc., 2009, 20, 2, 322-332, https://doi.org/10.1590/S0103-50532009000200018 . [all data]

Kupcinskiene, Stikliene, et al., 2008
Kupcinskiene, E.; Stikliene, A.; Judzentiene, A., The essential oil guatitative composition in the needles of Pinus sylvestris L. growing along industrial transects, Environ. Pollution, 2008, 155, 3, 481-491, https://doi.org/10.1016/j.envpol.2008.02.001 . [all data]

Lo Presti, Sciarrone, et al., 2008
Lo Presti, M.; Sciarrone, D.; Crupi, M.C.; Costa, R.; Ragusa, S.; Dugo, G.; Mondello, L., Evaliation of the volatile and chiral composition in Pistacia lentiscus L. essential oil, Flavour Fragr. J., 2008, 23, 4, 249-257, https://doi.org/10.1002/ffj.1878 . [all data]

Qiao, Xie, et al., 2008
Qiao, Y.; Xie, B.J.; Zhang, Y.; Zhang, Y.; FAn, G.; Yao, X.L.; Pan, S.Y., Characterization of aroma active compounds in fruit juice and peel oil of Junchen sweet orange fruit (Citrus sinensis (L.) Osbeck) by GC-MS and GC-O, Molecules, 2008, 13, 6, 1333-1344, https://doi.org/10.3390/molecules13061333 . [all data]

Cajka, Hajslova, et al., 2007
Cajka, T.; Hajslova, J.; Cochran, J.; Holadova, K.; Klimankova, E., Solid phase microextraction - comprehensive two dimensional gas chromatography - time-of-flight mass spectrometry for the analysis of honey volatiles, J. Sep. Sci., 2007, 30, 4, 534-546, https://doi.org/10.1002/jssc.200600413 . [all data]

Cole, Haber, et al., 2007
Cole, R.A.; Haber, W.A.; Setzer, W.N., Chemical composition of essential oils of seven species of Eugenia from Monteverde, Costa Rica, Biochem. Syst. Ecol., 2007, 35, 12, 877-886, https://doi.org/10.1016/j.bse.2007.06.013 . [all data]

Ferreira, Meireles de Sousa, et al., 2007
Ferreira, N.J.; Meireles de Sousa, I.G.; Luís, T.C.; Currais, A.J.M.; Figueiredo, C.; Cost, M.M.; Lima, A.S.B.; Santos, P.A.G.; Barroso, J.G.; Pedro, L.G.; Scheffer, J.J.C., Pittosporum undulatum Vent. grown in Portugal: secretory structures, seasonal variation and enantiomeric composition of its essential oil, Flavour Fragr. J., 2007, 22, 1, 1-9, https://doi.org/10.1002/ffj.1748 . [all data]

Haznagy-Radnai, Szigle, et al., 2007
Haznagy-Radnai, E.; Szigle, Sz.; Mathe, I., Analysis of the essential oil of Downy wounderwort (Stachys Germanica L.), Acta Fac. Pharm. Univer. Comenianae, 2007, 54, 78-83. [all data]

Liolios, Laouer, et al., 2007
Liolios, C.; Laouer, H.; Boulaacheb, N.; Gortzi, O.; Chinou, I., Chemical Composition and Antimicrobial Activity of the Essential Oil of Algherian Phlomis bovei De Noe subsp. bovei, Molecules, 2007, 12, 4, 772-781, https://doi.org/10.3390/12040772 . [all data]

Meekijjaroenroj, Bessière, et al., 2007
Meekijjaroenroj, A.; Bessière, J.-M.; Anstett, M.-C., Chemistry of floral scents in four Licuala species (Arecaceae), Flavour Fragr. J., 2007, 22, 4, 300-310, https://doi.org/10.1002/ffj.1797 . [all data]

Mockute, Bernotiene, et al., 2007
Mockute, D.; Bernotiene, G.; Judzentiene, A., The essential oil of Ground Ivy (Glechoma hederaceae L.) growing wild in Eastern Lithuania, J. Essent. Oil Res., 2007, 19, 5, 449-451, https://doi.org/10.1080/10412905.2007.9699948 . [all data]

Moriarity, Bansal, et al., 2007
Moriarity, D.M.; Bansal, A.; Cole, R.A.; Takaku, S.; Haber, W.A.; Setzer, W.N., Selective cytotoxic activities of leaf essential oils from Monteverde Costa Rica, Natural Product Communications, 2007, 2, 12, 1263-1268. [all data]

Moronkola, Ogunwande, et al., 2007
Moronkola, D.O.; Ogunwande, I.A.; Walker, T.M.; Setzer, W.N.; Oyewole, I.O., Identification of the main volatile compounds in the leaf and flower of Tithonia diversifolia (Hemsl) Gray, J. Nat. Med., 2007, 61, 1, 63-66, https://doi.org/10.1007/s11418-006-0019-5 . [all data]

Radusiene, Judzentiene, et al., 2007
Radusiene, J.; Judzentiene, A.; Peciulyte, D.; Janulis, V., Essential Oil Composition and Antimicrobial Assay of Acorus calamus Leaves from Different Wild Populations, Plant Genetic Resources: Characterization and Utilization, 2007, 5, 1, 37-44, https://doi.org/10.1017/S1479262107390928 . [all data]

Rodrigues, Antunes, et al., 2007
Rodrigues, F.S.L.M.; Antunes, L.C.S.; Figueiredo, A.C.; Costa, M.M.; Pereira, J.D.S.; Colaço, R.D.R.; Miranda, H.H.S.; Barroso, J.G.; Pedro, L.G.; Scheffer, J.J.C., Composition of the leaf, flower and fruit volatile oils of Pittosporum tobira (Thunb.) W. T. Aiton grown in three locations in Portugal, Flavour Fragr. J., 2007, 22, 4, 311-316, https://doi.org/10.1002/ffj.1798 . [all data]

Stokes, Cole, et al., 2007
Stokes, S.L.; Cole, R.A.; Rangelova, M.P.; Haber, W.A.; Setzer, W.N., Cruzain inhibitory activity of the leaf essential oil from an undescribed species of Eugenia from Monteverde, Costa Rica, Natural Product Communications, 2007, 2, 12, 1211-1213. [all data]

Takaku, Haber, et al., 2007
Takaku, S.; Haber, W.A.; Setzer, W.N., Leaf essential oil composition of 10 species of Ocotea (Lauraceae) from Monteverde, Costa Rica, Biochem. Syst. Ecol., 2007, 35, 8, 525-532, https://doi.org/10.1016/j.bse.2007.02.003 . [all data]

Werka, Boehme, et al., 2007
Werka, J.S.; Boehme, A.K.; Setzer, W.N., Biological activities of essential oils from Monteverde, Costa Rica, Natural Product Communications, 2007, 2, 12, 1215-1219. [all data]

Deng, Xu, et al., 2006
Deng, C.; Xu, X.; Yao, N.; Li, N.; Zhang, X., Rapid determination of essential oil compounds in Artemisia Selengensis Turcz by gas chromatography-mass spectrometry with microwave distillation and simultaneous solid-phase microextraction, Anal. Chim. Acta., 2006, 556, 2, 289-294, https://doi.org/10.1016/j.aca.2005.09.038 . [all data]

Güllüce, Özer, et al., 2006
Güllüce, M.; Özer, H.; Baris, Ö.; Daferera, D.; Sahin, F.; Polissiou, M., Chemical Composition of the Essential Oil of Salvia aethiopis L., Turkish Journal of Biology, 2006, 30, 231-233. [all data]

de Lima, Maia, et al., 2006
de Lima, M.G.A.; Maia, I.C.C.; de Sousa, M.D.; de Morais, S.M.; Freitas, S.M., Effect of stalk and leaf extracts from euphorbiaceae species on Aedes aegypti (Diptera, culicidae) larvae, Rev. Inst. Med. trop. S. Paulo, 2006, 48, 4, 211-214, https://doi.org/10.1590/S0036-46652006000400007 . [all data]

Massardo, Senatore, et al., 2006
Massardo, D.R.; Senatore, F.; Alifano, P.; del Giudice, L.; Pontieri, P., Vetiver oil production correlates with early root growth, Biochem. Syst. Ecol., 2006, 34, 5, 376-382, https://doi.org/10.1016/j.bse.2005.10.016 . [all data]

Mockute, Bernotiene, et al., 2006
Mockute, D.; Bernotiene, G.; Judzentiene, A., Germacrene D chemotype of essential oils of Leonurus cardiaca L. growing wild in Vilnus district (Lithuania), J. Essent. Oil Res., 2006, 18, 5, 566-568, https://doi.org/10.1080/10412905.2006.9699169 . [all data]

Navickiene, Morandim, et al., 2006
Navickiene, H.M.D.; Morandim, A.A.; Alécio, A.C.; Regasini, L.O.; Bergamo, D.C.B.; Telascrea, M.; Cavalheiro, A.J.; Lopes, M.N.; Bolzani, V.S.; Furlan, M.; Marques, M.O.M.; Young, M.C.M.; Kato, M.J., Composition and antifungal activity of essential oils from Piper aduncum, Piper arboreum and Piper tuberculatum, Quim. Nova, 2006, 29, 3, 467-470, https://doi.org/10.1590/S0100-40422006000300012 . [all data]

Schmidt, Noletto, et al., 2006
Schmidt, J.M.; Noletto, J.A.; Vogler, B.; Setzer, W.N., Abaco Bush Medicine: Chemical composition of the essential oils of four aromatic medicinal plants from Abaco Island, Bahamas, J. Herbs, Spices Medicinal Plants, 2006, 12, 3, 43-65, https://doi.org/10.1300/J044v12n03_04 . [all data]

Soumaghi, Amin, et al., 2006
Soumaghi, M.H.S.; Amin, G.; Samadi, N., Chemical composition and antimicrobial activity of essential oil of Salvia spinosa L., Asian J. Plant Sci., 2006, 5, 4, 654-656, https://doi.org/10.3923/ajps.2006.654.656 . [all data]

Srivastava, Mallavarapu, et al., 2006
Srivastava, S.; Mallavarapu, G.R.; Rai, S.K.; Singh, D.; Mishra, R.; Pandey-Rai, S.; Kumar, S., Composition of the essential oils of the leaves and flowers of Rhus mysurensis Heyne ex Wight Arn growing in the Aravalli mountain range at New Delhi, Flavour Fragr. J., 2006, 21, 2, 228-229, https://doi.org/10.1002/ffj.1561 . [all data]

Butkienë, Nivinskienë, et al., 2005
Butkienë, R.; Nivinskienë, O.; Mockutë, D., α-Pinene chemotype of leaf (needle) essential oils of Juniperus communis L. growing wild in Vilnius district, Chemija, 2005, 16, 1, 53-60. [all data]

Deng, Yao, et al., 2005
Deng, C.; Yao, N.; Wang, A.; Zhang, X., Determination of essential oil in a traditional Chinese medicine, Fructus amomi by pressurized hot water extraction followed by liquid-phase microextraction and gas chromatography-mass spectrometry, Anal. Chim. Acta., 2005, 536, 1-2, 237-244, https://doi.org/10.1016/j.aca.2004.12.044 . [all data]

Grombone-Guaratini, Silva-Brandão, et al., 2005
Grombone-Guaratini, M.T.; Silva-Brandão, K.L.; Solferini, V.N.; Semir, J.; Trigo, J.R., Sesquiterpene and polyacetylene profile of the Bidens pilosa complex (Asteraceae: Heliantheae) from Southeast of Brazil, Biochem. Syst. Ecol., 2005, 33, 5, 479-486, https://doi.org/10.1016/j.bse.2004.11.005 . [all data]

Hamm, Bleton, et al., 2005
Hamm, S.; Bleton, J.; Connan, J.; Tchapla, A., A chemical investigation by headspace SPME and GC-MS of volatile and semi-volatile terpenes in various olibanum samples, Phytochemistry, 2005, 66, 12, 1499-1514, https://doi.org/10.1016/j.phytochem.2005.04.025 . [all data]

Radudienë, Judpintienë, et al., 2005
Radudienë, J.; Judpintienë, A.; Peèiulytë, D.; Janulis, V., Chemical composition of essential oil and antimicrobial activity of Origanum vulgare, Biologija, 2005, 4, 53-58. [all data]

Couladis, Özcan, et al., 2004
Couladis, M.; Özcan, M.; Tzakou, O.; Akgül, A., Menengic (Pistacia terebinthus L.) agacinin degisik organlarinda ucucu yag bilesimi, Bitkisel Ilac Hammaddeleri Toplantisi, Bildiriler, 29-31 Mayis 2002, 2004, 6. [all data]

Letchamo, Ward, et al., 2004
Letchamo, W.; Ward, W.; Heard, B.; Heard, D., Essential oil of Valeriana officinalis L. cultivars and their antimicrobial activity as influenced by harvesting time under commercial organic cultivation, J. Agric. Food Chem., 2004, 52, 12, 3915-3919, https://doi.org/10.1021/jf0353990 . [all data]

Mockutë, Bernotienë, et al., 2004
Mockutë, D.; Bernotienë, G.; Judbentienë, A., Chemical composition of essential oils of Origanum vulgare L. growing in Lithuania, Biologija, 2004, 4, 44-49. [all data]

Mockutë, Judbentienë, et al., 2004
Mockutë, D.; Judbentienë, A.; Bernotienë, G., Volatile constituents of cultivated Origanum vulgare L. inflorescences and leaves, Chemija, 2004, 15, 1, 33-37. [all data]

Singh, Marimuthu, et al., 2004
Singh, G.; Marimuthu, P.; Catalan, C.; deLampasona, M.P., Chemical, antioxidant and antifungal activities of volatile oil of black pepper and its acetone extract, J. Sci. Food Agric., 2004, 84, 14, 1878-1884, https://doi.org/10.1002/jsfa.1863 . [all data]

Vilaseca, Guy, et al., 2004
Vilaseca, A.; Guy, I.; Charles, B.; Guinaudeau, H.; de Arias, A.R.; Fournet, A., Chemical composition and insecticidal activity of Hedeoma mandoniana essential oils, J. Essent. Oil Res., 2004, 16, 4, 380-383, https://doi.org/10.1080/10412905.2004.9698749 . [all data]

Vinogradov, 2004
Vinogradov, B.A., Production, composition, properties and application of essential oils, 2004, retrieved from http://viness.narod.ru. [all data]

Hamm, Lesellier, et al., 2003
Hamm, S.; Lesellier, E.; Bleton, J.; Tchapla, A., Optimization of headspace solid phase microextraction for gas chromatography/mass spectrometry analysis of widely different volatility and polarity terpenoids in olibanum, J. Chromatogr. A, 2003, 1018, 1, 73-83, https://doi.org/10.1016/j.chroma.2003.08.027 . [all data]

Jordán, Martínez, et al., 2003
Jordán, M.J.; Martínez, R.M.; Cases, M.A.; Sotomayor. J.A., Watering level effect on Thymus hyemalis lange essential oil yield and composition, J. Agric. Food Chem., 2003, 51, 18, 5420-5427, https://doi.org/10.1021/jf034335m . [all data]

Lima, Veiga, et al., 2003
Lima, S.R.M.; Veiga, V.F., Jr.; Christo, H.B.; Pinto, A.C.; Fernandes, P.D., In vivo and in vitro studies on the anticancer activity of Copaifera multijuga Hayne and its fractions, Phytother. Res., 2003, 17, 9, 1048-1053, https://doi.org/10.1002/ptr.1295 . [all data]

Mockute, Bernotiene, et al., 2003
Mockute, D.; Bernotiene, G.; Judzentiene, A., Volatile compounds of the aerial parts of wild St. John's wort (Hypericum perforatum L.) plants, Chemija, 2003, 14, 3, 108-111. [all data]

Mockute, Bernotiene, et al., 2003, 2
Mockute, D.; Bernotiene, G.; Judzentiene, A., The β-ocimene chemotype of essential oils of the inflorescences and the leaves with stems from Origanum vulgare ssp. vulgare growing wild in Lithuania, Biochem. Syst. Ecol., 2003, 31, 3, 269-278, https://doi.org/10.1016/S0305-1978(02)00151-5 . [all data]

Mockute and Judzentiene, 2003
Mockute, D.; Judzentiene, A., The myrtenol chemotype of essential oil of Tanacetum vulgare L. var. vulgare (tansy) growing wild in the Vilnius region, Chemija, 2003, 14, 2, 103-107. [all data]

Mockute, Nivinskiene, et al., 2003
Mockute, D.; Nivinskiene, O.; Bernotiene, G.; Butkiene, R., The cis-thujone chemotype of Salvia officinalis L. essential oils, Chemija, 2003, 14, 4, 216-220. [all data]

Li, Wu, et al., 2002
Li, C.; Wu, H.; Yang, L.; ren, Y., Study of the composition of ginger oil from Laifeng, Flavour Fragr. Cosmetics, 2002, 5, 15-17. [all data]

Viana, Andrade-Neto, et al., 2002
Viana, F.A.; Andrade-Neto, M.; Pouliquen, Y.B.M.; Uchoa, D.E.A.; Sobral, M.M.S.Z.; de Morais, S.M., Essential oil of Siparuna guianensis aublet from the Amazon region of Brazil, J. Essent. Oil Res., 2002, 14, 1, 60-62, https://doi.org/10.1080/10412905.2002.9699765 . [all data]

Petrakis, Tsitsimpikou, et al., 2001
Petrakis, P.V.; Tsitsimpikou, C.; Tzakou, O.; Couladis, M.; Vagias, C.; Roussis, V., Needle volatiles from five Pinus species growing in Greece, Flavour Fragr. J., 2001, 16, 4, 249-252, https://doi.org/10.1002/ffj.990 . [all data]

Prikhod'ko, Klyuev, et al., 1999
Prikhod'ko, A.B.; Klyuev, N.A.; Volkovich, S.V.; Emets, T.I.; Petrenko, V.V.; Dolya, E.V., Component composition od the essential oil of Thymus dimorphus, Chem. Nat. Comp., 1999, 35, 1, 46-51, https://doi.org/10.1007/BF02238208 . [all data]

Weyerstahl, Marschall, et al., 1999
Weyerstahl, P.; Marschall, H.; Son, P.T.; Giang, P.M., Constituents of the flower essential oil of Aglaia odorata Lour. from Vietnam, Flavour Fragr. J., 1999, 14, 4, 219-224, https://doi.org/10.1002/(SICI)1099-1026(199907/08)14:4<219::AID-FFJ815>3.0.CO;2-# . [all data]

Yusuf, Begum, et al., 1998
Yusuf, M.; Begum, J.; Mondello, L.; Stagno d'Alcontres, I.S., Studies on the essential oil bearing plants of Bangladesh. Part VI. Composition of the oil of Ocimum gratissimum L., Flavour Fragr. J., 1998, 13, 3, 163-166, https://doi.org/10.1002/(SICI)1099-1026(199805/06)13:3<163::AID-FFJ714>3.0.CO;2-1 . [all data]

Zenkevich, 1996
Zenkevich, I.G., Analytical Parameters of Components of Essential Oils for their Chromatographic and Chromato-Mass Spectral Identification. Mono- and Sesquiterpenes, Rastitelnye Resursy (Plant resources), 1996, 34, 1-2, 48-58. [all data]

Menut, Lamaty, et al., 1994
Menut, C.; Lamaty, G.; Bessiere, J.M.; Ayedoun, M.A.; Setondji, J.; Samate, D.; Nacro, M., Aromatic Plants from Tropical West Africa. II. Volatile Constituents of Daniella oliveri (Rolfe) Hutch Dalz. from Benin and Burkina Faso, J. Essent. Oil Res., 1994, 6, 6, 647-649, https://doi.org/10.1080/10412905.1994.9699362 . [all data]