2-Pyrenamine

Gas phase ion energetics data

Data compiled by: Henry M. Rosenstock, Keith Draxl, Bruce W. Steiner, and John T. Herron

Ionization energy determinations

IE (eV) Method Reference
7.4 ± 0.1CTSFarrell and Newton, 1966

Lee's RI, non-polar column, temperature ramp

View large format table.

Column type Active phase I Reference Comment
CapillarySE-52413.83Vassilaros, Kong, et al., 198220. m/0.30 mm/0.25 μm, H2, 40. C @ 2. min, 4. K/min; Tend: 265. C

References

Farrell and Newton, 1966
Farrell, P.G.; Newton, J., Ionization potentials of primary aromatic amines and aza-hydrocarbons, Tetrahedron Lett., 1966, 5517. [all data]

Bol'shakov, et al., 1969
Bol'shakov, G.F., et al., Ultraviolet spectra of heteroorganic compounds, 1969, 173. [all data]

Vassilaros, Kong, et al., 1982
Vassilaros, D.L.; Kong, R.C.; Later, D.W.; Lee, M.L., Linear retention index system for polycyclic aromatic compounds. Critical evaluation and additional indices, J. Chromatogr., 1982, 252, 1-20, https://doi.org/10.1016/S0021-9673(01)88394-1 . [all data]