Pyrene, 1,2,3,6,7,8-hexahydro-
- Formula: C16H16
- Molecular weight: 208.2982
- IUPAC Standard InChIKey: MBAIEZXRGAOPKH-UHFFFAOYSA-N
- CAS Registry Number: 1732-13-4
- Chemical structure:

Gas phase thermochemistry data

Data compiled by: Hussein Y. Afeefy, Joel F. Liebman, and Stephen E. Stein
Quantity | Value | Units | Method | Reference | Comment |
---|---|---|---|---|---|
ΔfH°gas | 40.7 ± 1.8 | kJ/mol | Ccb | Chirico, Knipmeyer, et al., 1993 |

Phase change data

Data compiled as indicated in comments:
TRC - Thermodynamics Research Center, NIST Boulder Laboratories, Chris Muzny director
AC - William E. Acree, Jr., James S. Chickos
DRB - Donald R. Burgess, Jr.
CAL - James S. Chickos, William E. Acree, Jr., Joel F. Liebman, Students of Chem 202 (Introduction to the Literature of Chemistry), University of Missouri -- St. Louis
DH - Eugene S. Domalski and Elizabeth D. Hearing
Quantity | Value | Units | Method | Reference | Comment |
---|---|---|---|---|---|
Ttriple | 407.630 | K | N/A | Chirico, Knipmeyer, et al., 1993, 2 | Crystal phase 1 phase; Uncertainty assigned by TRC = 0.01 K; TRC |
Quantity | Value | Units | Method | Reference | Comment |
ΔsubH° | 84.8 | kJ/mol | N/A | Chirico, Knipmeyer, et al., 1993 | DRB |
Enthalpy of vaporization
ΔvapH (kJ/mol) | Temperature (K) | Method | Reference | Comment |
---|---|---|---|---|
72.0 | 440. | EB,IP | Chirico, Knipmeyer, et al., 1993 | AC |
69.4 | 480. | EB,IP | Chirico, Knipmeyer, et al., 1993 | AC |
66.8 | 520. | EB,IP | Chirico, Knipmeyer, et al., 1993 | AC |
64.2 | 560. | EB,IP | Chirico, Knipmeyer, et al., 1993 | AC |
61.5 | 600. | EB,IP | Chirico, Knipmeyer, et al., 1993 | AC |
Enthalpy of sublimation
ΔsubH (kJ/mol) | Temperature (K) | Method | Reference | Comment |
---|---|---|---|---|
92.3 | 398. | IP | Chirico, Knipmeyer, et al., 1993 | Based on data from 390. to 405. K.; AC |
Enthalpy of fusion
ΔfusH (kJ/mol) | Temperature (K) | Reference | Comment |
---|---|---|---|
18.09 | 407.7 | Chirico, Knipmeyer, et al., 1993 | AC |
Entropy of fusion
ΔfusS (J/mol*K) | Temperature (K) | Reference | Comment |
---|---|---|---|
13.32 | 377. | Chirico, Knipmeyer, et al., 1993, 3 | CAL |
44.37 | 407.7 |
Enthalpy of phase transition
ΔHtrs (kJ/mol) | Temperature (K) | Initial Phase | Final Phase | Reference | Comment |
---|---|---|---|---|---|
9.9791 | 377.00 | crystaline, II | crystaline, I | Chirico, Knipmeyer, et al., 1993 | DH |
18.0932 | 407.635 | crystaline, I | liquid | Chirico, Knipmeyer, et al., 1993 | DH |

Van Den Dool and Kratz RI, non-polar column, temperature ramp

Column type | Active phase | I | Reference | Comment |
---|---|---|---|---|
Capillary | OV-1 | 2019.0 | Zhang, Shen, et al., 2000 | 25. m/0.2 mm/0.33 μm, 5. K/min; Tstart: 100. C; Tend: 180. C |
Capillary | OV-1 | 2031.1 | Zhang, Shen, et al., 2000 | 25. m/0.2 mm/0.33 μm, 5. K/min; Tstart: 100. C; Tend: 180. C |

Lee's RI, non-polar column, temperature ramp

Column type | Active phase | I | Reference | Comment |
---|---|---|---|---|
Capillary | DB-5 | 342.3 | Durlak, Biswas, et al., 1998 | 30. m/0.25 mm/0.25 μm, 15. K/min; Tstart: 50. C; Tend: 300. C |
Capillary | DB-5 | 342.3 | Durlak, Biswas, et al., 1998 | 30. m/0.25 mm/0.25 μm, 15. K/min; Tstart: 50. C; Tend: 300. C |
Capillary | SE-54 | 339.22 | Guillén, Blanco, et al., 1989 | 20. m/0.22 mm/0.20 μm, He, 4. K/min; Tstart: 50. C; Tend: 300. C |
Capillary | SE-52 | 339.38 | Lee, Vassilaros, et al., 1979 | 12. m/0.3 mm/0.34 μm, He, 2. K/min; Tstart: 50. C; Tend: 250. C |

Condensed phase thermochemistry data

Data compiled as indicated in comments:
ALS - Hussein Y. Afeefy, Joel F. Liebman, and Stephen E. Stein
DH - Eugene S. Domalski and Elizabeth D. Hearing
Quantity | Value | Units | Method | Reference | Comment |
---|---|---|---|---|---|
ΔfH°solid | -44.1 ± 1.9 | kJ/mol | Ccb | Chirico, Knipmeyer, et al., 1993 | ALS |
Quantity | Value | Units | Method | Reference | Comment |
ΔcH°solid | -8538.8 ± 1.7 | kJ/mol | Ccb | Chirico, Knipmeyer, et al., 1993 | Corresponding ΔfHºsolid = -44.05 kJ/mol (simple calculation by NIST; no Washburn corrections); ALS |
Quantity | Value | Units | Method | Reference | Comment |
S°solid,1 bar | 236.26 | J/mol*K | N/A | Chirico, Knipmeyer, et al., 1993 | crystaline, II phase; DH |
Constant pressure heat capacity of solid
Cp,solid (J/mol*K) | Temperature (K) | Reference | Comment |
---|---|---|---|
255.54 | 298.15 | Chirico, Knipmeyer, et al., 1993 | crystaline, II phase; T = 5 to 700 K.; DH |

References

Chirico, Knipmeyer, et al., 1993
Chirico, R.D.; Knipmeyer, S.E.; Nguyen, A.; Smith, N.K.; Steele, W.V.,
The thermodynamic properties of 4,5,9,10-tetra-hydropyrene and of 1,2,3,6,7,8-hexahydropyrene,
J. Chem. Thermodyn., 1993, 25, 729-761. [all data]
Chirico, Knipmeyer, et al., 1993, 2
Chirico, R.D.; Knipmeyer, S.E.; Nguyen, A.; Smith, N.K.; Steele, W.V.,
The thermodynamic properties of 4,5,9,10-tetrahydropyrene and of 1,2,3,6,7,8-hexahydropyrene,
J. Chem. Thermodyn., 1993, 25, 729-61. [all data]
Chirico, Knipmeyer, et al., 1993, 3
Chirico, R.D.; Knipmeyer, S.E.; Nguyen, A.; Smith, N.K.; Steele, W.V.,
The thermodynamic properties of 4,5,9,10-tetrahydropyrene and of 1,2,3,6,7,8-hexahydropyrene,
J. Chem. Thermodyn., 1993, 25, 6, 729, https://doi.org/10.1006/jcht.1993.1071
. [all data]
Zhang, Shen, et al., 2000
Zhang, M.-J.; Shen, S.-D.; Chen, S.-Y.; Sun, Y.-H.,
Analysis of heavy oil fractions in high-temperature coal tar by capillary gas chromatography/fourier transform infrared spectrometry,
Chin. J. Chromatogr., 2000, 18, 3, 241-246. [all data]
Durlak, Biswas, et al., 1998
Durlak, S.K.; Biswas, P.; Shi, J.; Bernhard, M.J.,
Characterization of polycyclic aromatic hydrocarbon particulate and gaseous emissions from polystyrene combustion,
Environ. Sci. Technol., 1998, 32, 15, 2301-2307, https://doi.org/10.1021/es9709031
. [all data]
Guillén, Blanco, et al., 1989
Guillén, M.D.; Blanco, J.; Bermejo, J.; Blanco, C.G.,
Temperature programmed retention indices of some PAHs on Capillary columns coated with OV-1701 and SE-54,
J. Hi. Res. Chromatogr., 1989, 12, 8, 552-554, https://doi.org/10.1002/jhrc.1240120816
. [all data]
Lee, Vassilaros, et al., 1979
Lee, M.L.; Vassilaros, D.L.; White, C.M.; Novotny, M.,
Retention Indices for Programmed-Temperature Capillary-Column Gas Chromatography of Polycyclic Aromatic Hydrocarbons,
Anal. Chem., 1979, 51, 6, 768-773, https://doi.org/10.1021/ac50042a043
. [all data]